BDBM126587 US8772283, 31
SMILES:
InChI Key: InChIKey=KTVVTSJFHWCMMT-UHFFFAOYSA-N
Data: 2 IC50
Activity Spreadsheet -- Enzyme Inhibition Constant Data from BindingDB
Found 2 hits for monomerid = 126587
Trg + Lig
Ki
nM
ΔG°
kcal/mole
IC50
nM
Kd
nM
EC50/IC50
nM
koff
s-1
kon
M-1s-1
pHTemp
°C
RAC-beta serine/threonine-protein kinase
(Homo sapiens (Human))
BDBM126587
(US8772283, 31)
Show InChI InChI=1S/C27H26N4O2/c1-2-26(32)15-27(28,16-26)20-10-8-18(9-11-20)23-24(19-6-4-3-5-7-19)31-17-33-22-12-13-29-14-21(22)25(31)30-23/h3-14,32H,2,15-17,28H2,1H3
US Patent
n/an/a 0.780n/an/an/an/a7.5n/a
Taiho Pharmaceutical Co., Ltd.
US Patent
Assay Description
Preparation of AKT1 and AKT2 and measurement of in vitro inhibitory activity of the above-mentioned compounds against AKT1 and AKT2 kinase activity w...
US Patent US8772283 (2014)
BindingDB Entry DOI: 10.7270/Q21J98F0
RAC-alpha serine/threonine-protein kinase
(Homo sapiens (Human))
BDBM126587
(US8772283, 31)
Show InChI InChI=1S/C27H26N4O2/c1-2-26(32)15-27(28,16-26)20-10-8-18(9-11-20)23-24(19-6-4-3-5-7-19)31-17-33-22-12-13-29-14-21(22)25(31)30-23/h3-14,32H,2,15-17,28H2,1H3
US Patent
n/an/a 4.20n/an/an/an/a7.5n/a
Taiho Pharmaceutical Co., Ltd.
US Patent
Assay Description
Preparation of AKT1 and AKT2 and measurement of in vitro inhibitory activity of the above-mentioned compounds against AKT1 and AKT2 kinase activity w...
US Patent US8772283 (2014)
BindingDB Entry DOI: 10.7270/Q21J98F0