BDBM126609 US8772283, 53
SMILES:
InChI Key: InChIKey=OVYJFJXATSHOSL-UHFFFAOYSA-N
Data: 2 IC50
Activity Spreadsheet -- Enzyme Inhibition Constant Data from BindingDB
Found 2 hits for monomerid = 126609
Trg + Lig
Ki
nM
ΔG°
kcal/mole
IC50
nM
Kd
nM
EC50/IC50
nM
koff
s-1
kon
M-1s-1
pHTemp
°C
RAC-beta serine/threonine-protein kinase
(Homo sapiens (Human))
BDBM126609
(US8772283, 53)
Show InChI InChI=1S/C28H26N4O3/c1-27(34)14-28(30,15-27)20-10-7-17(8-11-20)23-24(18-5-3-2-4-6-18)32-16-35-22-12-9-19(25(29)33)13-21(22)26(32)31-23/h2-13,34H,14-16,30H2,1H3,(H2,29,33)
US Patent
n/an/a 0.260n/an/an/an/a7.5n/a
Taiho Pharmaceutical Co., Ltd.
US Patent
Assay Description
Preparation of AKT1 and AKT2 and measurement of in vitro inhibitory activity of the above-mentioned compounds against AKT1 and AKT2 kinase activity w...
US Patent US8772283 (2014)
BindingDB Entry DOI: 10.7270/Q21J98F0
RAC-alpha serine/threonine-protein kinase
(Homo sapiens (Human))
BDBM126609
(US8772283, 53)
Show InChI InChI=1S/C28H26N4O3/c1-27(34)14-28(30,15-27)20-10-7-17(8-11-20)23-24(18-5-3-2-4-6-18)32-16-35-22-12-9-19(25(29)33)13-21(22)26(32)31-23/h2-13,34H,14-16,30H2,1H3,(H2,29,33)
US Patent
n/an/a 1.60n/an/an/an/a7.5n/a
Taiho Pharmaceutical Co., Ltd.
US Patent
Assay Description
Preparation of AKT1 and AKT2 and measurement of in vitro inhibitory activity of the above-mentioned compounds against AKT1 and AKT2 kinase activity w...
US Patent US8772283 (2014)
BindingDB Entry DOI: 10.7270/Q21J98F0