BDBM126662 US8785638, 146
SMILES: CCCC(C(O)=O)c1c(C)nc2sc3CCCCc3c2c1-c1ccc2OCOc2c1
InChI Key: InChIKey=GBHSAHKMCAYTJQ-UHFFFAOYSA-N
Data: 1 IC50
Activity Spreadsheet -- Enzyme Inhibition Constant Data from BindingDB
Found 1 hit for monomerid = 126662
Trg + Lig
Ki
nM
ΔG°
kcal/mole
IC50
nM
Kd
nM
EC50/IC50
nM
koff
s-1
kon
M-1s-1
pHTemp
°C
Protease
(Human immunodeficiency virus type 1 (HIV-1))
BDBM126662
(US8785638, 146)
Show SMILES CCCC(C(O)=O)c1c(C)nc2sc3CCCCc3c2c1-c1ccc2OCOc2c1
Show InChI InChI=1S/C24H25NO4S/c1-3-6-16(24(26)27)20-13(2)25-23-22(15-7-4-5-8-19(15)30-23)21(20)14-9-10-17-18(11-14)29-12-28-17/h9-11,16H,3-8,12H2,1-2H3,(H,26,27)
US Patent
n/an/a 4.76E+3n/an/an/an/a7.44
Katholieke Universiteit Leuven
US Patent
Assay Description
The AlphaScreen assay was performed according to the manufacturer's protocol (Perkin Elmer, Benelux). Reactions were performed in 25 ul final volume ...
US Patent US8785638 (2014)
BindingDB Entry DOI: 10.7270/Q2S18167