BDBM12670 1-(3-Aminobenzisoxazol-5-yl)-3-trifluoromethyl-5-[[(2-aminocarbonyl-4-(2-methylimidazol-1-yl)phenyl]aminocarbonyl]pyrazole, Bis(trifluoroacetic acid) Salt::1-(3-amino-1,2-benzoxazol-5-yl)-N-[2-carbamoyl-4-(2-methyl-1H-imidazol-1-yl)phenyl]-3-(trifluoromethyl)-1H-pyrazole-5-carboxamide; bis(2,2,2-trifluoroacetic acid)::Razaxaban Analogue::aminobenzisoxazole 46
SMILES: Cc1nccn1-c1ccc(NC(=O)c2cc(nn2-c2ccc3onc(N)c3c2)C(F)(F)F)c(c1)C(N)=O
InChI Key: InChIKey=XEHHJCXFVJSRRN-UHFFFAOYSA-N
Data: 2 KI
PDB links: 1 PDB ID contains inhibitors having a similarity of 90% to this monomer.
Activity Spreadsheet -- Enzyme Inhibition Constant Data from BindingDB
Found 2 hits for monomerid = 12670
Trg + Lig
Ki
nM
ΔG°
kcal/mole
IC50
nM
Kd
nM
EC50/IC50
nM
koff
s-1
kon
M-1s-1
pHTemp
°C
Coagulation factor X
(Homo sapiens (Human))
BDBM12670
(1-(3-Aminobenzisoxazol-5-yl)-3-trifluoromethyl-5-[...)
Show SMILES Cc1nccn1-c1ccc(NC(=O)c2cc(nn2-c2ccc3onc(N)c3c2)C(F)(F)F)c(c1)C(N)=O
Show InChI InChI=1S/C23H17F3N8O3/c1-11-29-6-7-33(11)12-2-4-16(14(8-12)21(28)35)30-22(36)17-10-19(23(24,25)26)31-34(17)13-3-5-18-15(9-13)20(27)32-37-18/h2-10H,1H3,(H2,27,32)(H2,28,35)(H,30,36)
Reactome pathway
7.70 -10.9n/an/an/an/an/a7.022
Bristol-Myers Squibb Pharmaceutical Research Institute
Assay Description
Ki values were obtained from human purified enzyme. All assays were run in microtiter plates. Plates were read for 30 min at 405 nm. Rates were deter...
J Med Chem 48: 1729-44 (2005)
Article DOI: 10.1021/jm0497949
BindingDB Entry DOI: 10.7270/Q2BK19K9
Prothrombin
(Homo sapiens (Human))
BDBM12670
(1-(3-Aminobenzisoxazol-5-yl)-3-trifluoromethyl-5-[...)
Show SMILES Cc1nccn1-c1ccc(NC(=O)c2cc(nn2-c2ccc3onc(N)c3c2)C(F)(F)F)c(c1)C(N)=O
Show InChI InChI=1S/C23H17F3N8O3/c1-11-29-6-7-33(11)12-2-4-16(14(8-12)21(28)35)30-22(36)17-10-19(23(24,25)26)31-34(17)13-3-5-18-15(9-13)20(27)32-37-18/h2-10H,1H3,(H2,27,32)(H2,28,35)(H,30,36)
>2.10E+4n/an/an/an/an/an/an/an/a
Bristol-Myers Squibb Pharmaceutical Research Institute
Assay Description
Ki values were obtained from human purified enzyme. All assays were run in microtiter plates. Plates were read for 30 min at 405 nm. Rates were deter...
J Med Chem 48: 1729-44 (2005)
Article DOI: 10.1021/jm0497949
BindingDB Entry DOI: 10.7270/Q2BK19K9