BDBM127171 US8791272, 2.48
SMILES: CCc1nn(Cc2ccc(NC(=O)c3cccc4ccccc34)cc2)c(C2CC2)c1CC(O)=O
InChI Key: InChIKey=QLXSREOWEOCBAI-UHFFFAOYSA-N
Data: 1 KI
Activity Spreadsheet -- Enzyme Inhibition Constant Data from BindingDB
Found 1 hit for monomerid = 127171
Trg + Lig
Ki
nM
ΔG°
kcal/mole
IC50
nM
Kd
nM
EC50/IC50
nM
koff
s-1
kon
M-1s-1
pHTemp
°C
G protein-coupled receptor 44
(Homo sapiens (Human))
BDBM127171
(US8791272, 2.48)
Show SMILES CCc1nn(Cc2ccc(NC(=O)c3cccc4ccccc34)cc2)c(C2CC2)c1CC(O)=O
Show InChI InChI=1S/C28H27N3O3/c1-2-25-24(16-26(32)33)27(20-12-13-20)31(30-25)17-18-10-14-21(15-11-18)29-28(34)23-9-5-7-19-6-3-4-8-22(19)23/h3-11,14-15,20H,2,12-13,16-17H2,1H3,(H,29,34)(H,32,33)
Reactome pathway
US Patent
1.80n/an/an/an/an/an/a7.4n/a
Boehringer Ingelheim International GmbH
US Patent
Assay Description
The CRTH2 receptor binding assay is performed in a scintillation proximity assay (SPA) format with the radioligand [3H]-PGD2 (Perkin Elmer, NET616000...
US Patent US8791272 (2014)
BindingDB Entry DOI: 10.7270/Q2GH9GNV