BDBM127209 US8791272, 7.5
SMILES: Cc1nn(Cc2ccc(NC(=O)c3ccc4ccccc4c3)cc2C)c(C)c1CC(O)=O
InChI Key: InChIKey=JSAMABZKHDGRRF-UHFFFAOYSA-N
Data: 1 KI
Activity Spreadsheet -- Enzyme Inhibition Constant Data from BindingDB
Found 1 hit for monomerid = 127209
Trg + Lig
Ki
nM
ΔG°
kcal/mole
IC50
nM
Kd
nM
EC50/IC50
nM
koff
s-1
kon
M-1s-1
pHTemp
°C
G protein-coupled receptor 44
(Homo sapiens (Human))
BDBM127209
(US8791272, 7.5)
Show SMILES Cc1nn(Cc2ccc(NC(=O)c3ccc4ccccc4c3)cc2C)c(C)c1CC(O)=O
Show InChI InChI=1S/C26H25N3O3/c1-16-12-23(27-26(32)21-9-8-19-6-4-5-7-20(19)13-21)11-10-22(16)15-29-18(3)24(14-25(30)31)17(2)28-29/h4-13H,14-15H2,1-3H3,(H,27,32)(H,30,31)
Reactome pathway
US Patent
0.300n/an/an/an/an/an/a7.4n/a
Boehringer Ingelheim International GmbH
US Patent
Assay Description
The CRTH2 receptor binding assay is performed in a scintillation proximity assay (SPA) format with the radioligand [3H]-PGD2 (Perkin Elmer, NET616000...
US Patent US8791272 (2014)
BindingDB Entry DOI: 10.7270/Q2GH9GNV