BDBM127442 US8791131, 216
SMILES: CN(C)c1ccc(cn1)-c1ccc2ncc3n(C)c(=O)n(C4CCN(CC4)C(=O)CO)c3c2n1
InChI Key: InChIKey=XQLUKUIXLCBLHW-UHFFFAOYSA-N
Data: 2 KI
Activity Spreadsheet -- Enzyme Inhibition Constant Data from BindingDB
Found 2 hits for monomerid = 127442
Trg + Lig
Ki
nM
ΔG°
kcal/mole
IC50
nM
Kd
nM
EC50/IC50
nM
koff
s-1
kon
M-1s-1
pHTemp
°C
Phosphatidylinositol 4,5-bisphosphate 3-kinase catalytic subunit alpha isoform
(Homo sapiens (Human))
BDBM127442
(US8791131, 216)
Show SMILES CN(C)c1ccc(cn1)-c1ccc2ncc3n(C)c(=O)n(C4CCN(CC4)C(=O)CO)c3c2n1
Show InChI InChI=1S/C24H27N7O3/c1-28(2)20-7-4-15(12-26-20)17-5-6-18-22(27-17)23-19(13-25-18)29(3)24(34)31(23)16-8-10-30(11-9-16)21(33)14-32/h4-7,12-13,16,32H,8-11,14H2,1-3H3
NCI pathway
Reactome pathway
US Patent
0.505 -12.7n/an/an/an/an/a7.425
Pfizer Inc.
US Patent
Assay Description
Compounds of the present invention were evaluated for potency against PI3-Kalpha using an in vitro kinase assay. PI3-Kalpha activity is measured in v...
US Patent US8791131 (2014)
BindingDB Entry DOI: 10.7270/Q23B5XV8
Serine/threonine-protein kinase mTOR
(Homo sapiens (Human))
BDBM127442
(US8791131, 216)
Show SMILES CN(C)c1ccc(cn1)-c1ccc2ncc3n(C)c(=O)n(C4CCN(CC4)C(=O)CO)c3c2n1
Show InChI InChI=1S/C24H27N7O3/c1-28(2)20-7-4-15(12-26-20)17-5-6-18-22(27-17)23-19(13-25-18)29(3)24(34)31(23)16-8-10-30(11-9-16)21(33)14-32/h4-7,12-13,16,32H,8-11,14H2,1-3H3
NCI pathway
Reactome pathway
US Patent
2.29 -11.8n/an/an/an/an/a7.525
Pfizer Inc.
US Patent
Assay Description
Compounds of the present invention were evaluated for potency against mTOR using an in vitro kinase assay. mTOR activity is measured in vitro by dete...
US Patent US8791131 (2014)
BindingDB Entry DOI: 10.7270/Q23B5XV8