BDBM127485 US8791131, 263
SMILES: CN1CCC(CC1)n1c2c(cnc3ccc(nc23)-c2cnc3[nH]ncc3c2)n(C)c1=O
InChI Key: InChIKey=BCLLEOJYENBBDN-UHFFFAOYSA-N
Data: 2 KI
Activity Spreadsheet -- Enzyme Inhibition Constant Data from BindingDB
Found 2 hits for monomerid = 127485
Trg + Lig
Ki
nM
ΔG°
kcal/mole
IC50
nM
Kd
nM
EC50/IC50
nM
koff
s-1
kon
M-1s-1
pHTemp
°C
Phosphatidylinositol 4,5-bisphosphate 3-kinase catalytic subunit alpha isoform
(Homo sapiens (Human))
BDBM127485
(US8791131, 263)
Show SMILES CN1CCC(CC1)n1c2c(cnc3ccc(nc23)-c2cnc3[nH]ncc3c2)n(C)c1=O
Show InChI InChI=1S/C22H22N8O/c1-28-7-5-15(6-8-28)30-20-18(29(2)22(30)31)12-23-17-4-3-16(26-19(17)20)13-9-14-11-25-27-21(14)24-10-13/h3-4,9-12,15H,5-8H2,1-2H3,(H,24,25,27)
NCI pathway
Reactome pathway
US Patent
0.282 -13.0n/an/an/an/an/a7.425
Pfizer Inc.
US Patent
Assay Description
Compounds of the present invention were evaluated for potency against PI3-Kalpha using an in vitro kinase assay. PI3-Kalpha activity is measured in v...
US Patent US8791131 (2014)
BindingDB Entry DOI: 10.7270/Q23B5XV8
Serine/threonine-protein kinase mTOR
(Homo sapiens (Human))
BDBM127485
(US8791131, 263)
Show SMILES CN1CCC(CC1)n1c2c(cnc3ccc(nc23)-c2cnc3[nH]ncc3c2)n(C)c1=O
Show InChI InChI=1S/C22H22N8O/c1-28-7-5-15(6-8-28)30-20-18(29(2)22(30)31)12-23-17-4-3-16(26-19(17)20)13-9-14-11-25-27-21(14)24-10-13/h3-4,9-12,15H,5-8H2,1-2H3,(H,24,25,27)
NCI pathway
Reactome pathway
US Patent
5.67 -11.2n/an/an/an/an/a7.525
Pfizer Inc.
US Patent
Assay Description
Compounds of the present invention were evaluated for potency against mTOR using an in vitro kinase assay. mTOR activity is measured in vitro by dete...
US Patent US8791131 (2014)
BindingDB Entry DOI: 10.7270/Q23B5XV8