null
SMILES: CCc1ccc(N[C@@H](c2ccc(Cl)c(C)c2)C(F)(F)F)cc1CN1CC[C@H](C1)C(O)=O
InChI Key: InChIKey=MIEDPOILSJSDPI-UTKZUKDTSA-N
Activity Spreadsheet -- Enzyme Inhibition Constant Data from BindingDB
Found 1 hit for monomerid = 127536
Trg + Lig
Ki
nM
ΔG°
kcal/mole
IC50
nM
Kd
nM
EC50/IC50
nM
koff
s-1
kon
M-1s-1
pHTemp
°C
Sphingosine 1-phosphate receptor 1
(Homo sapiens (Human))
BDBM127536
(US8791100, 34)
Show SMILES CCc1ccc(N[C@@H](c2ccc(Cl)c(C)c2)C(F)(F)F)cc1CN1CC[C@H](C1)C(O)=O |r|
Show InChI InChI=1S/C23H26ClF3N2O2/c1-3-15-4-6-19(11-18(15)13-29-9-8-17(12-29)22(30)31)28-21(23(25,26)27)16-5-7-20(24)14(2)10-16/h4-7,10-11,17,21,28H,3,8-9,12-13H2,1-2H3,(H,30,31)/t17-,21+/m1/s1
Reactome pathway
US Patent
n/an/a 0.800n/an/an/an/an/a37
Novartis AG
US Patent
Assay Description
The assay measures intracellular changes of Ca2+ mediated by the synthetic probing agonist 3-{[2-(2-Trifluoromethyl-biphenyl-4-yl)-benzo[b]thiophen-5...
US Patent US8791100 (2014)
BindingDB Entry DOI: 10.7270/Q2ZK5FCC