null
SMILES: CC[C@@H](Nc1cc(CN2CC(C2)C(O)=O)c(Cl)cn1)c1ccc(Cl)c(C)c1
InChI Key: InChIKey=UDQOAJHRNGNHEH-GOSISDBHSA-N
Activity Spreadsheet -- Enzyme Inhibition Constant Data from BindingDB
Found 1 hit for monomerid = 127581
Trg + Lig
Ki
nM
ΔG°
kcal/mole
IC50
nM
Kd
nM
EC50/IC50
nM
koff
s-1
kon
M-1s-1
pHTemp
°C
Sphingosine 1-phosphate receptor 1
(Homo sapiens (Human))
BDBM127581
(US8791100, 79)
Show SMILES CC[C@@H](Nc1cc(CN2CC(C2)C(O)=O)c(Cl)cn1)c1ccc(Cl)c(C)c1 |r|
Show InChI InChI=1S/C20H23Cl2N3O2/c1-3-18(13-4-5-16(21)12(2)6-13)24-19-7-14(17(22)8-23-19)9-25-10-15(11-25)20(26)27/h4-8,15,18H,3,9-11H2,1-2H3,(H,23,24)(H,26,27)/t18-/m1/s1
Reactome pathway
US Patent
n/an/a 0.600n/an/an/an/an/a37
Novartis AG
US Patent
Assay Description
The assay measures intracellular changes of Ca2+ mediated by the synthetic probing agonist 3-{[2-(2-Trifluoromethyl-biphenyl-4-yl)-benzo[b]thiophen-5...
US Patent US8791100 (2014)
BindingDB Entry DOI: 10.7270/Q2ZK5FCC