null
SMILES: Cc1cc(ccc1Cl)[C@H](Nc1cc(CN2CC[C@H](C2)C(O)=O)c(Cl)cn1)C(F)(F)F
InChI Key: InChIKey=QNSKFSYNLGLARS-ACJLOTCBSA-N
Activity Spreadsheet -- Enzyme Inhibition Constant Data from BindingDB
Found 1 hit for monomerid = 127586
Trg + Lig
Ki
nM
ΔG°
kcal/mole
IC50
nM
Kd
nM
EC50/IC50
nM
koff
s-1
kon
M-1s-1
pHTemp
°C
Sphingosine 1-phosphate receptor 1
(Homo sapiens (Human))
BDBM127586
(US8791100, 84)
Show SMILES Cc1cc(ccc1Cl)[C@H](Nc1cc(CN2CC[C@H](C2)C(O)=O)c(Cl)cn1)C(F)(F)F |r|
Show InChI InChI=1S/C20H20Cl2F3N3O2/c1-11-6-12(2-3-15(11)21)18(20(23,24)25)27-17-7-14(16(22)8-26-17)10-28-5-4-13(9-28)19(29)30/h2-3,6-8,13,18H,4-5,9-10H2,1H3,(H,26,27)(H,29,30)/t13-,18+/m1/s1
Reactome pathway
US Patent
n/an/a 0.400n/an/an/an/an/a37
Novartis AG
US Patent
Assay Description
The assay measures intracellular changes of Ca2+ mediated by the synthetic probing agonist 3-{[2-(2-Trifluoromethyl-biphenyl-4-yl)-benzo[b]thiophen-5...
US Patent US8791100 (2014)
BindingDB Entry DOI: 10.7270/Q2ZK5FCC