BDBM128301 US8796284, 10
SMILES: Nc1nc(nc(NC2CCC2)c1Br)-n1cccn1
InChI Key: InChIKey=VUEAJDKKLYSRME-UHFFFAOYSA-N
Data: 1 KI
Activity Spreadsheet -- Enzyme Inhibition Constant Data from BindingDB
Found 1 hit for monomerid = 128301
Trg + Lig
Ki
nM
ΔG°
kcal/mole
IC50
nM
Kd
nM
EC50/IC50
nM
koff
s-1
kon
M-1s-1
pHTemp
°C
Adenosine receptor A2a
(Homo sapiens (Human))
BDBM128301
(US8796284, 10)
Show SMILES Nc1nc(nc(NC2CCC2)c1Br)-n1cccn1
Show InChI InChI=1S/C11H13BrN6/c12-8-9(13)16-11(18-6-2-5-14-18)17-10(8)15-7-3-1-4-7/h2,5-7H,1,3-4H2,(H3,13,15,16,17)
NCI pathway
Reactome pathway
US Patent
21 -10.5n/an/an/an/an/an/a25
Palobiofarma, S.L.
US Patent
Assay Description
Competition assays were carried out by incubation of membranes from hA1 receptors transfected to CHO cells, [3H]-DPCPX as radioligand, buffer (HEPES ...
US Patent US8796284 (2014)
BindingDB Entry DOI: 10.7270/Q2WM1C2Q