BDBM128307 US8796284, 38
SMILES: CC(C)Sc1nc(nc(N)c1Br)-n1cccn1
InChI Key: InChIKey=SFZCZMOHXMUHDZ-UHFFFAOYSA-N
Data: 1 KI
Activity Spreadsheet -- Enzyme Inhibition Constant Data from BindingDB
Found 1 hit for monomerid = 128307
Trg + Lig
Ki
nM
ΔG°
kcal/mole
IC50
nM
Kd
nM
EC50/IC50
nM
koff
s-1
kon
M-1s-1
pHTemp
°C
Adenosine receptor A2a
(Homo sapiens (Human))
BDBM128307
(US8796284, 38)
Show SMILES CC(C)Sc1nc(nc(N)c1Br)-n1cccn1
Show InChI InChI=1S/C10H12BrN5S/c1-6(2)17-9-7(11)8(12)14-10(15-9)16-5-3-4-13-16/h3-6H,1-2H3,(H2,12,14,15)
NCI pathway
Reactome pathway
US Patent
7 -11.1n/an/an/an/an/an/a25
Palobiofarma, S.L.
US Patent
Assay Description
Competition assays were carried out by incubation of membranes from hA1 receptors transfected to CHO cells, [3H]-DPCPX as radioligand, buffer (HEPES ...
US Patent US8796284 (2014)
BindingDB Entry DOI: 10.7270/Q2WM1C2Q