BDBM128308 US8796284, 44
SMILES: Nc1nc(nc(OCC(F)(F)F)c1Br)-n1cccn1
InChI Key: InChIKey=FWJUNYDCSATLOX-UHFFFAOYSA-N
Data: 1 KI
Activity Spreadsheet -- Enzyme Inhibition Constant Data from BindingDB
Found 1 hit for monomerid = 128308
Trg + Lig
Ki
nM
ΔG°
kcal/mole
IC50
nM
Kd
nM
EC50/IC50
nM
koff
s-1
kon
M-1s-1
pHTemp
°C
Adenosine receptor A2a
(Homo sapiens (Human))
BDBM128308
(US8796284, 44)
Show SMILES Nc1nc(nc(OCC(F)(F)F)c1Br)-n1cccn1
Show InChI InChI=1S/C9H7BrF3N5O/c10-5-6(14)16-8(18-3-1-2-15-18)17-7(5)19-4-9(11,12)13/h1-3H,4H2,(H2,14,16,17)
NCI pathway
Reactome pathway
US Patent
14 -10.7n/an/an/an/an/an/a25
Palobiofarma, S.L.
US Patent
Assay Description
Competition assays were carried out by incubation of membranes from hA1 receptors transfected to CHO cells, [3H]-DPCPX as radioligand, buffer (HEPES ...
US Patent US8796284 (2014)
BindingDB Entry DOI: 10.7270/Q2WM1C2Q