BDBM128427 US8796244, 6
SMILES: CN1CCC(CC1)n1cc(cn1)-c1ccn2c(cnc2c1)-c1cccc(NC(=O)NCC(F)(F)F)c1
InChI Key: InChIKey=DIHKHDKCPLEBJZ-UHFFFAOYSA-N
Data: 2 IC50
Activity Spreadsheet -- Enzyme Inhibition Constant Data from BindingDB
Found 2 hits for monomerid = 128427
Trg + Lig
Ki
nM
ΔG°
kcal/mole
IC50
nM
Kd
nM
EC50/IC50
nM
koff
s-1
kon
M-1s-1
pHTemp
°C
Vascular endothelial growth factor receptor 2
(Homo sapiens (Human))
BDBM128427
(US8796244, 6)
Show SMILES CN1CCC(CC1)n1cc(cn1)-c1ccn2c(cnc2c1)-c1cccc(NC(=O)NCC(F)(F)F)c1
Show InChI InChI=1S/C25H26F3N7O/c1-33-8-6-21(7-9-33)35-15-19(13-31-35)17-5-10-34-22(14-29-23(34)12-17)18-3-2-4-20(11-18)32-24(36)30-16-25(26,27)28/h2-5,10-15,21H,6-9,16H2,1H3,(H2,30,32,36)
NCI pathway
Reactome pathway
US Patent
n/an/a 13.4n/an/an/an/a8.025
Astex Therapeutics Ltd
US Patent
Assay Description
VEGFR2 (from Upstate), prepared at 2x final concentration, was incubated with test compounds, biotinylated Flt3 substrate (biotin-VASSDNEYFYVDF) (Cel...
US Patent US8796244 (2014)
BindingDB Entry DOI: 10.7270/Q20C4TFP
Fibroblast growth factor receptor 3
(Homo sapiens (Human))
BDBM128427
(US8796244, 6)
Show SMILES CN1CCC(CC1)n1cc(cn1)-c1ccn2c(cnc2c1)-c1cccc(NC(=O)NCC(F)(F)F)c1
Show InChI InChI=1S/C25H26F3N7O/c1-33-8-6-21(7-9-33)35-15-19(13-31-35)17-5-10-34-22(14-29-23(34)12-17)18-3-2-4-20(11-18)32-24(36)30-16-25(26,27)28/h2-5,10-15,21H,6-9,16H2,1H3,(H2,30,32,36)
Reactome pathway
US Patent
n/an/a 0.545n/an/an/an/a8.025
Astex Therapeutics Ltd
US Patent
Assay Description
Enzymes (from Upstate) were prepared at 2× final concentration in 1× kinase assay buffer (Table 1). Enzymes were then incubated with test compounds, ...
US Patent US8796244 (2014)
BindingDB Entry DOI: 10.7270/Q20C4TFP