BDBM128436 US8796244, 15
SMILES: NC(=CCC(=N)N1CCOCC1)c1ccn2c(cnc2c1)-c1cccc(NC(=O)NCC(F)(F)F)c1
InChI Key: InChIKey=XEIJGSZLPPJMDB-UHFFFAOYSA-N
Data: 2 IC50
Activity Spreadsheet -- Enzyme Inhibition Constant Data from BindingDB
Found 2 hits for monomerid = 128436
Trg + Lig
Ki
nM
ΔG°
kcal/mole
IC50
nM
Kd
nM
EC50/IC50
nM
koff
s-1
kon
M-1s-1
pHTemp
°C
Vascular endothelial growth factor receptor 2
(Homo sapiens (Human))
BDBM128436
(US8796244, 15)
Show SMILES NC(=CCC(=N)N1CCOCC1)c1ccn2c(cnc2c1)-c1cccc(NC(=O)NCC(F)(F)F)c1 |w:2.2|
Show InChI InChI=1S/C24H26F3N7O2/c25-24(26,27)15-31-23(35)32-18-3-1-2-17(12-18)20-14-30-22-13-16(6-7-34(20)22)19(28)4-5-21(29)33-8-10-36-11-9-33/h1-4,6-7,12-14,29H,5,8-11,15,28H2,(H2,31,32,35)
NCI pathway
Reactome pathway
US Patent
n/an/a 11.5n/an/an/an/a8.025
Astex Therapeutics Ltd
US Patent
Assay Description
VEGFR2 (from Upstate), prepared at 2x final concentration, was incubated with test compounds, biotinylated Flt3 substrate (biotin-VASSDNEYFYVDF) (Cel...
US Patent US8796244 (2014)
BindingDB Entry DOI: 10.7270/Q20C4TFP
Fibroblast growth factor receptor 3
(Homo sapiens (Human))
BDBM128436
(US8796244, 15)
Show SMILES NC(=CCC(=N)N1CCOCC1)c1ccn2c(cnc2c1)-c1cccc(NC(=O)NCC(F)(F)F)c1 |w:2.2|
Show InChI InChI=1S/C24H26F3N7O2/c25-24(26,27)15-31-23(35)32-18-3-1-2-17(12-18)20-14-30-22-13-16(6-7-34(20)22)19(28)4-5-21(29)33-8-10-36-11-9-33/h1-4,6-7,12-14,29H,5,8-11,15,28H2,(H2,31,32,35)
Reactome pathway
US Patent
n/an/a 0.640n/an/an/an/a8.025
Astex Therapeutics Ltd
US Patent
Assay Description
Enzymes (from Upstate) were prepared at 2× final concentration in 1× kinase assay buffer (Table 1). Enzymes were then incubated with test compounds, ...
US Patent US8796244 (2014)
BindingDB Entry DOI: 10.7270/Q20C4TFP