BDBM128513 US8796244, 92
SMILES: OCc1ccc(nc1)-c1ccn2c(cnc2c1)-c1cccc(NC(=O)NCC(F)(F)F)c1
InChI Key: InChIKey=NBZBEZQNNHINQM-UHFFFAOYSA-N
Data: 2 IC50
Activity Spreadsheet -- Enzyme Inhibition Constant Data from BindingDB
Found 2 hits for monomerid = 128513
Trg + Lig
Ki
nM
ΔG°
kcal/mole
IC50
nM
Kd
nM
EC50/IC50
nM
koff
s-1
kon
M-1s-1
pHTemp
°C
Vascular endothelial growth factor receptor 2
(Homo sapiens (Human))
BDBM128513
(US8796244, 92)
Show SMILES OCc1ccc(nc1)-c1ccn2c(cnc2c1)-c1cccc(NC(=O)NCC(F)(F)F)c1
Show InChI InChI=1S/C22H18F3N5O2/c23-22(24,25)13-28-21(32)29-17-3-1-2-16(8-17)19-11-27-20-9-15(6-7-30(19)20)18-5-4-14(12-31)10-26-18/h1-11,31H,12-13H2,(H2,28,29,32)
NCI pathway
Reactome pathway
US Patent
n/an/a 29n/an/an/an/a8.025
Astex Therapeutics Ltd
US Patent
Assay Description
VEGFR2 (from Upstate), prepared at 2x final concentration, was incubated with test compounds, biotinylated Flt3 substrate (biotin-VASSDNEYFYVDF) (Cel...
US Patent US8796244 (2014)
BindingDB Entry DOI: 10.7270/Q20C4TFP
Fibroblast growth factor receptor 3
(Homo sapiens (Human))
BDBM128513
(US8796244, 92)
Show SMILES OCc1ccc(nc1)-c1ccn2c(cnc2c1)-c1cccc(NC(=O)NCC(F)(F)F)c1
Show InChI InChI=1S/C22H18F3N5O2/c23-22(24,25)13-28-21(32)29-17-3-1-2-16(8-17)19-11-27-20-9-15(6-7-30(19)20)18-5-4-14(12-31)10-26-18/h1-11,31H,12-13H2,(H2,28,29,32)
Reactome pathway
US Patent
n/an/a 0.940n/an/an/an/a8.025
Astex Therapeutics Ltd
US Patent
Assay Description
Enzymes (from Upstate) were prepared at 2× final concentration in 1× kinase assay buffer (Table 1). Enzymes were then incubated with test compounds, ...
US Patent US8796244 (2014)
BindingDB Entry DOI: 10.7270/Q20C4TFP