BDBM12853 Aminobenzisoxazole 2v::{[2-(4-{[1-(3-amino-1,2-benzoxazol-5-yl)-3-(trifluoromethyl)-1H-pyrazole-5-]amido}-3-fluorophenyl)phenyl]methyl}trimethylazanium bromide
SMILES: C[N+](C)(C)Cc1ccccc1-c1ccc(NC(=O)c2cc(nn2-c2ccc3onc(N)c3c2)C(F)(F)F)c(F)c1
InChI Key: InChIKey=DJBYALCJSXJBHB-UHFFFAOYSA-O
Data: 1 KI
PDB links: 1 PDB ID contains inhibitors having a similarity of 90% to this monomer.
Activity Spreadsheet -- Enzyme Inhibition Constant Data from BindingDB
Found 1 hit for monomerid = 12853
Trg + Lig
Ki
nM
ΔG°
kcal/mole
IC50
nM
Kd
nM
EC50/IC50
nM
koff
s-1
kon
M-1s-1
pHTemp
°C
Coagulation factor X
(Homo sapiens (Human))
BDBM12853
(Aminobenzisoxazole 2v | {[2-(4-{[1-(3-amino-1,2-be...)
Show SMILES C[N+](C)(C)Cc1ccccc1-c1ccc(NC(=O)c2cc(nn2-c2ccc3onc(N)c3c2)C(F)(F)F)c(F)c1
Show InChI InChI=1S/C28H24F4N6O2/c1-38(2,3)15-17-6-4-5-7-19(17)16-8-10-22(21(29)12-16)34-27(39)23-14-25(28(30,31)32)35-37(23)18-9-11-24-20(13-18)26(33)36-40-24/h4-14H,15H2,1-3H3,(H2-,33,34,36,39)/p+1
Reactome pathway
0.0500 -13.9n/an/an/an/an/a7.022
Bristol-Myers Squibb Pharmaceutical Research Institute
Assay Description
Ki values were obtained from human purified enzyme. All assays were run in microtiter plates. Plates were read for 30 min at 405 nm. Rates were deter...
Bioorg Med Chem Lett 16: 1795-8 (2006)
Article DOI: 10.1016/j.bmcl.2006.01.010
BindingDB Entry DOI: 10.7270/Q2FB515N