BDBM128566 US8796244, 152
SMILES: FC(F)(F)CNC(=O)Nc1cncc(c1)-c1cnc2cc(ccn12)-c1cnn(c1)C1CCNCC1
InChI Key: InChIKey=MHKDNJZDYJPDJU-UHFFFAOYSA-N
Data: 2 IC50
Activity Spreadsheet -- Enzyme Inhibition Constant Data from BindingDB
Found 2 hits for monomerid = 128566
Trg + Lig
Ki
nM
ΔG°
kcal/mole
IC50
nM
Kd
nM
EC50/IC50
nM
koff
s-1
kon
M-1s-1
pHTemp
°C
Vascular endothelial growth factor receptor 2
(Homo sapiens (Human))
BDBM128566
(US8796244, 152)
Show SMILES FC(F)(F)CNC(=O)Nc1cncc(c1)-c1cnc2cc(ccn12)-c1cnn(c1)C1CCNCC1
Show InChI InChI=1S/C23H23F3N8O/c24-23(25,26)14-30-22(35)32-18-7-16(9-28-11-18)20-12-29-21-8-15(3-6-33(20)21)17-10-31-34(13-17)19-1-4-27-5-2-19/h3,6-13,19,27H,1-2,4-5,14H2,(H2,30,32,35)
NCI pathway
Reactome pathway
US Patent
n/an/a 15.3n/an/an/an/a8.025
Astex Therapeutics Ltd
US Patent
Assay Description
VEGFR2 (from Upstate), prepared at 2x final concentration, was incubated with test compounds, biotinylated Flt3 substrate (biotin-VASSDNEYFYVDF) (Cel...
US Patent US8796244 (2014)
BindingDB Entry DOI: 10.7270/Q20C4TFP
Fibroblast growth factor receptor 3
(Homo sapiens (Human))
BDBM128566
(US8796244, 152)
Show SMILES FC(F)(F)CNC(=O)Nc1cncc(c1)-c1cnc2cc(ccn12)-c1cnn(c1)C1CCNCC1
Show InChI InChI=1S/C23H23F3N8O/c24-23(25,26)14-30-22(35)32-18-7-16(9-28-11-18)20-12-29-21-8-15(3-6-33(20)21)17-10-31-34(13-17)19-1-4-27-5-2-19/h3,6-13,19,27H,1-2,4-5,14H2,(H2,30,32,35)
Reactome pathway
US Patent
n/an/a 0.930n/an/an/an/a8.025
Astex Therapeutics Ltd
US Patent
Assay Description
Enzymes (from Upstate) were prepared at 2× final concentration in 1× kinase assay buffer (Table 1). Enzymes were then incubated with test compounds, ...
US Patent US8796244 (2014)
BindingDB Entry DOI: 10.7270/Q20C4TFP