BDBM128897 US8802711, 66
SMILES: Fc1ccccc1[C@@H]1CC[C@H](C1)NC(=O)Nc1cccc2[nH]ncc12
InChI Key: InChIKey=MNXPYZUSFURMKS-CHWSQXEVSA-N
Data: 1 IC50
Activity Spreadsheet -- Enzyme Inhibition Constant Data from BindingDB
Found 1 hit for monomerid = 128897
Trg + Lig
Ki
nM
ΔG°
kcal/mole
IC50
nM
Kd
nM
EC50/IC50
nM
koff
s-1
kon
M-1s-1
pHTemp
°C
Transient receptor potential cation channel subfamily V member 1
(Homo sapiens (Human))
BDBM128897
(US8802711, 66)
Show SMILES Fc1ccccc1[C@@H]1CC[C@H](C1)NC(=O)Nc1cccc2[nH]ncc12
Show InChI InChI=1S/C19H19FN4O/c20-16-5-2-1-4-14(16)12-8-9-13(10-12)22-19(25)23-17-6-3-7-18-15(17)11-21-24-18/h1-7,11-13H,8-10H2,(H,21,24)(H2,22,23,25)/t12-,13-/m1/s1
Reactome pathway
US Patent
n/an/a 8.20n/an/an/an/an/an/a
AbbVie Inc.
US Patent
Assay Description
The functional activity of compounds at the TRPV1 receptor was determined by measurement of intracellular Ca2+ levels ([Ca2+]i) using the Fluorescenc...
US Patent US8802711 (2014)
BindingDB Entry DOI: 10.7270/Q2QZ28NC