null
SMILES: COc1ccc(cc1-c1nc2C(=O)N(C(c2n1C(C)C)c1ccc(Cl)cc1C)c1cc(Cl)ccc1C)C(=O)NCCO
InChI Key: InChIKey=AMMRSBMBAHSSAG-UHFFFAOYSA-N
Activity Spreadsheet -- Enzyme Inhibition Constant Data from BindingDB
Found 2 hits for monomerid = 129732
Trg + Lig
Ki
nM
ΔG°
kcal/mole
IC50
nM
Kd
nM
EC50/IC50
nM
koff
s-1
kon
M-1s-1
pHTemp
°C
Protein Mdm4
(Homo sapiens (Human))
BDBM129732
(US8815926, 11)
Show SMILES COc1ccc(cc1-c1nc2C(=O)N(C(c2n1C(C)C)c1ccc(Cl)cc1C)c1cc(Cl)ccc1C)C(=O)NCCO
Show InChI InChI=1S/C32H32Cl2N4O4/c1-17(2)37-29-27(36-30(37)24-15-20(7-11-26(24)42-5)31(40)35-12-13-39)32(41)38(25-16-22(34)8-6-18(25)3)28(29)23-10-9-21(33)14-19(23)4/h6-11,14-17,28,39H,12-13H2,1-5H3,(H,35,40)
NCI pathway
US Patent
n/an/a 120n/an/an/an/an/an/a
Novartis AG
US Patent
Assay Description
The inhibition of p53-MDM2 and p53-MDM4 interactions is measured by time resolved fluorescence energy transfer (TR-FRET). Fluorescence energy transfe...
US Patent US8815926 (2014)
BindingDB Entry DOI: 10.7270/Q29P309G
E3 ubiquitin-protein ligase Mdm2
(Homo sapiens (Human))
BDBM129732
(US8815926, 11)
Show SMILES COc1ccc(cc1-c1nc2C(=O)N(C(c2n1C(C)C)c1ccc(Cl)cc1C)c1cc(Cl)ccc1C)C(=O)NCCO
Show InChI InChI=1S/C32H32Cl2N4O4/c1-17(2)37-29-27(36-30(37)24-15-20(7-11-26(24)42-5)31(40)35-12-13-39)32(41)38(25-16-22(34)8-6-18(25)3)28(29)23-10-9-21(33)14-19(23)4/h6-11,14-17,28,39H,12-13H2,1-5H3,(H,35,40)
NCI pathway
Reactome pathway
US Patent
n/an/a 0.150n/an/an/an/an/an/a
Novartis AG
US Patent
Assay Description
The inhibition of p53-MDM2 and p53-MDM4 interactions is measured by time resolved fluorescence energy transfer (TR-FRET). Fluorescence energy transfe...
US Patent US8815926 (2014)
BindingDB Entry DOI: 10.7270/Q29P309G