BDBM12998 5-Chloro-N-({(5S)-2-oxo-3-[4-(3-oxomorpholin-4-yl)-3-(trifluoromethyl)phenyl]-1,3-oxazolidin-5-yl}methyl)thiophene-2-carboxamide::5-chloro-N-{[(5S)-2-oxo-3-[4-(3-oxomorpholin-4-yl)-3-(trifluoromethyl)phenyl]-1,3-oxazolidin-5-yl]methyl}thiophene-2-carboxamide::BAY 59-7939 Analog 13
SMILES: FC(F)(F)c1cc(ccc1N1CCOCC1=O)N1C[C@H](CNC(=O)c2ccc(Cl)s2)OC1=O
InChI Key: InChIKey=DRBHMPWPYAXXIX-LBPRGKRZSA-N
Data: 1 IC50
Activity Spreadsheet -- Enzyme Inhibition Constant Data from BindingDB
Found 1 hit for monomerid = 12998
Trg + Lig
Ki
nM
ΔG°
kcal/mole
IC50
nM
Kd
nM
EC50/IC50
nM
koff
s-1
kon
M-1s-1
pHTemp
°C
Coagulation factor X
(Homo sapiens (Human))
BDBM12998
(5-Chloro-N-({(5S)-2-oxo-3-[4-(3-oxomorpholin-4-yl)...)
Show SMILES FC(F)(F)c1cc(ccc1N1CCOCC1=O)N1C[C@H](CNC(=O)c2ccc(Cl)s2)OC1=O |r|
Show InChI InChI=1S/C20H17ClF3N3O5S/c21-16-4-3-15(33-16)18(29)25-8-12-9-27(19(30)32-12)11-1-2-14(13(7-11)20(22,23)24)26-5-6-31-10-17(26)28/h1-4,7,12H,5-6,8-10H2,(H,25,29)/t12-/m0/s1
Reactome pathway
n/an/a 1n/an/an/an/a8.325
Bayer HealthCare AG
Assay Description
The enzymatic activity was measured using chromogenic or fluorogenic substrates in 96-well microtiter plates.Color change was monitored continuously ...
J Med Chem 48: 5900-8 (2005)
Article DOI: 10.1021/jm050101d
BindingDB Entry DOI: 10.7270/Q2J38QR6