BDBM1302 3-Aminopyridin-2(1H)-one analogue 22::5-ethyl-6-methyl-3-[(pyridin-2-ylmethyl)amino]-1,2-dihydropyridin-2-one::CHEMBL339138
SMILES: CCc1cc(NCc2ccccn2)c(=O)[nH]c1C
InChI Key: InChIKey=IXAOXJKGZNSFFD-UHFFFAOYSA-N
Data: 2 IC50
Activity Spreadsheet -- Enzyme Inhibition Constant Data from BindingDB
Found 2 hits for monomerid = 1302
Trg + Lig
Ki
nM
ΔG°
kcal/mole
IC50
nM
Kd
nM
EC50/IC50
nM
koff
s-1
kon
M-1s-1
pHTemp
°C
Human immunodeficiency virus type 1 reverse transcriptase
(Human immunodeficiency virus 1)
BDBM1302
(3-Aminopyridin-2(1H)-one analogue 22 | 5-ethyl-6-m...)
Show SMILES CCc1cc(NCc2ccccn2)c(=O)[nH]c1C
Show InChI InChI=1S/C14H17N3O/c1-3-11-8-13(14(18)17-10(11)2)16-9-12-6-4-5-7-15-12/h4-8,16H,3,9H2,1-2H3,(H,17,18)
n/an/a 1.51E+4n/an/an/an/an/an/a
Organon Research Laboratories
Curated by ChEMBL
Assay Description
Inhibition of HIV-1 reverse transcriptase (HIV-1 RT)
J Med Chem 39: 4065-72 (1996)
Article DOI: 10.1021/jm960058h
BindingDB Entry DOI: 10.7270/Q2Z039F0
HIV-1 Reverse Transcriptase
(Human immunodeficiency virus type 1)
BDBM1302
(3-Aminopyridin-2(1H)-one analogue 22 | 5-ethyl-6-m...)
Show SMILES CCc1cc(NCc2ccccn2)c(=O)[nH]c1C
Show InChI InChI=1S/C14H17N3O/c1-3-11-8-13(14(18)17-10(11)2)16-9-12-6-4-5-7-15-12/h4-8,16H,3,9H2,1-2H3,(H,17,18)
n/an/a 1.50E+4n/an/an/an/a8.2n/a
Merck Research Laboratories
Assay Description
The IC50 of reverse transcriptase is the concentration that inhibits 50% of recombinant HIV-1 RT RNA-directed DNA polymerase activity in vitro.
J Med Chem 35: 3792-802 (1992)
Article DOI: 10.1021/jm00099a007
BindingDB Entry DOI: 10.7270/Q2GH9G3P