BDBM13052 3-quinolinecarbonitrile analog 22::4-[(2,4-Dichloro-5-methoxyphenyl)amino]-6-methoxy-7-{5-[(dimethylamino)methyl]-3-furyl}-3-quinolinecarbonitrile::4-[(2,4-dichloro-5-methoxyphenyl)amino]-7-{5-[(dimethylamino)methyl]furan-3-yl}-6-methoxyquinoline-3-carbonitrile
SMILES: COc1cc(Nc2c(cnc3cc(-c4coc(CN(C)C)c4)c(OC)cc23)C#N)c(Cl)cc1Cl
InChI Key: InChIKey=XHRFFDAZHQMDPM-UHFFFAOYSA-N
Data: 1 IC50
Activity Spreadsheet -- Enzyme Inhibition Constant Data from BindingDB
Found 1 hit for monomerid = 13052
Trg + Lig
Ki
nM
ΔG°
kcal/mole
IC50
nM
Kd
nM
EC50/IC50
nM
koff
s-1
kon
M-1s-1
pHTemp
°C
Proto-oncogene tyrosine-protein kinase Src
(Homo sapiens (Human))
BDBM13052
(3-quinolinecarbonitrile analog 22 | 4-[(2,4-Dichlo...)
Show SMILES COc1cc(Nc2c(cnc3cc(-c4coc(CN(C)C)c4)c(OC)cc23)C#N)c(Cl)cc1Cl
Show InChI InChI=1S/C25H22Cl2N4O3/c1-31(2)12-16-5-14(13-34-16)17-6-21-18(7-23(17)32-3)25(15(10-28)11-29-21)30-22-9-24(33-4)20(27)8-19(22)26/h5-9,11,13H,12H2,1-4H3,(H,29,30)
n/an/a 0.75n/an/an/an/a7.537
Wyeth Research
Assay Description
Kinase assays were performed using the europium/APC detection format (LANCE, Perkin Elmer). HTRF is based on the proximity of europium cryptate (dono...
J Med Chem 49: 7868-76 (2006)
Article DOI: 10.1021/jm061031t
BindingDB Entry DOI: 10.7270/Q28K779J