BDBM130925 US8829190, 103
SMILES: COc1ccc(C(=O)Cc2c(Cl)cncc2Cl)n2nc(nc12)-c1ccco1
InChI Key: InChIKey=WOWDDTFMTILECG-UHFFFAOYSA-N
Data: 1 IC50
Activity Spreadsheet -- Enzyme Inhibition Constant Data from BindingDB
Found 1 hit for monomerid = 130925
Trg + Lig
Ki
nM
ΔG°
kcal/mole
IC50
nM
Kd
nM
EC50/IC50
nM
koff
s-1
kon
M-1s-1
pHTemp
°C
cAMP-specific 3',5'-cyclic phosphodiesterase 4A
(Homo sapiens (Human))
BDBM130925
(US8829190, 103)
Show SMILES COc1ccc(C(=O)Cc2c(Cl)cncc2Cl)n2nc(nc12)-c1ccco1
Show InChI InChI=1S/C18H12Cl2N4O3/c1-26-16-5-4-13(14(25)7-10-11(19)8-21-9-12(10)20)24-18(16)22-17(23-24)15-3-2-6-27-15/h2-6,8-9H,7H2,1H3
US Patent
n/an/a 7n/an/an/an/an/an/a
Leo Pharma A/S
US Patent
Assay Description
Human recombinant PDE4 (Gene bank accession no NM006203) was incubated for 1 hour with the test compound at concentrations up to 10 μM, with cAM...
US Patent US8829190 (2014)
BindingDB Entry DOI: 10.7270/Q2Z89B3Z