null
SMILES: COc1ccc(C(=O)Cc2c(Cl)cncc2Cl)n2nc(nc12)C1(CNCc2ccccc2)CC1
InChI Key: InChIKey=OONPKAUSYOVNRC-UHFFFAOYSA-N
Activity Spreadsheet -- Enzyme Inhibition Constant Data from BindingDB
Found 1 hit for monomerid = 130941
Trg + Lig
Ki
nM
ΔG°
kcal/mole
IC50
nM
Kd
nM
EC50/IC50
nM
koff
s-1
kon
M-1s-1
pHTemp
°C
cAMP-specific 3',5'-cyclic phosphodiesterase 4A
(Homo sapiens (Human))
BDBM130941
(US8829190, 119)
Show SMILES COc1ccc(C(=O)Cc2c(Cl)cncc2Cl)n2nc(nc12)C1(CNCc2ccccc2)CC1
Show InChI InChI=1S/C25H23Cl2N5O2/c1-34-22-8-7-20(21(33)11-17-18(26)13-28-14-19(17)27)32-23(22)30-24(31-32)25(9-10-25)15-29-12-16-5-3-2-4-6-16/h2-8,13-14,29H,9-12,15H2,1H3
US Patent
n/an/a 8n/an/an/an/an/an/a
Leo Pharma A/S
US Patent
Assay Description
Human recombinant PDE4 (Gene bank accession no NM006203) was incubated for 1 hour with the test compound at concentrations up to 10 μM, with cAM...
US Patent US8829190 (2014)
BindingDB Entry DOI: 10.7270/Q2Z89B3Z