BDBM130945 US8829190, 123
SMILES: COc1ccc(C(=O)Cc2c(Br)cncc2Br)n2nc(nc12)C1(CO)CC1
InChI Key: InChIKey=YDYODAPREUATFE-UHFFFAOYSA-N
Data: 1 IC50
Activity Spreadsheet -- Enzyme Inhibition Constant Data from BindingDB
Found 1 hit for monomerid = 130945
Trg + Lig
Ki
nM
ΔG°
kcal/mole
IC50
nM
Kd
nM
EC50/IC50
nM
koff
s-1
kon
M-1s-1
pHTemp
°C
cAMP-specific 3',5'-cyclic phosphodiesterase 4A
(Homo sapiens (Human))
BDBM130945
(US8829190, 123)
Show SMILES COc1ccc(C(=O)Cc2c(Br)cncc2Br)n2nc(nc12)C1(CO)CC1
Show InChI InChI=1S/C18H16Br2N4O3/c1-27-15-3-2-13(14(26)6-10-11(19)7-21-8-12(10)20)24-16(15)22-17(23-24)18(9-25)4-5-18/h2-3,7-8,25H,4-6,9H2,1H3
US Patent
n/an/a 68n/an/an/an/an/an/a
Leo Pharma A/S
US Patent
Assay Description
Human recombinant PDE4 (Gene bank accession no NM006203) was incubated for 1 hour with the test compound at concentrations up to 10 μM, with cAM...
US Patent US8829190 (2014)
BindingDB Entry DOI: 10.7270/Q2Z89B3Z