BDBM130948 US8829190, 126
SMILES: COc1ccc(C(=O)Cc2nccnc2Cl)n2nc(nc12)C1(CO)CC1
InChI Key: InChIKey=DWZHGDNRHKKIBK-UHFFFAOYSA-N
Data: 1 IC50
Activity Spreadsheet -- Enzyme Inhibition Constant Data from BindingDB
Found 1 hit for monomerid = 130948
Trg + Lig
Ki
nM
ΔG°
kcal/mole
IC50
nM
Kd
nM
EC50/IC50
nM
koff
s-1
kon
M-1s-1
pHTemp
°C
cAMP-specific 3',5'-cyclic phosphodiesterase 4A
(Homo sapiens (Human))
BDBM130948
(US8829190, 126)
Show SMILES COc1ccc(C(=O)Cc2nccnc2Cl)n2nc(nc12)C1(CO)CC1
Show InChI InChI=1S/C17H16ClN5O3/c1-26-13-3-2-11(12(25)8-10-14(18)20-7-6-19-10)23-15(13)21-16(22-23)17(9-24)4-5-17/h2-3,6-7,24H,4-5,8-9H2,1H3
US Patent
n/an/a 548n/an/an/an/an/an/a
Leo Pharma A/S
US Patent
Assay Description
Human recombinant PDE4 (Gene bank accession no NM006203) was incubated for 1 hour with the test compound at concentrations up to 10 μM, with cAM...
US Patent US8829190 (2014)
BindingDB Entry DOI: 10.7270/Q2Z89B3Z