BDBM130956 US8829010, 7
SMILES: CCc1ccc(cc1)-c1c(cnn1C)-c1nn(C)c2ncnc(N3CC[C@H](C3)N(C)C)c12
InChI Key: InChIKey=CRNMQZGODAGJNN-GOSISDBHSA-N
Data: 2 IC50
PDB links: 1 PDB ID matches this monomer.
Activity Spreadsheet -- Enzyme Inhibition Constant Data from BindingDB
Found 2 hits for monomerid = 130956
Trg + Lig
Ki
nM
ΔG°
kcal/mole
IC50
nM
Kd
nM
EC50/IC50
nM
koff
s-1
kon
M-1s-1
pHTemp
°C
Homo sapiens phosphodiesterase 2A (PDE2A)
(Homo sapiens (Human))
BDBM130956
(US8829010, 7)
Show SMILES CCc1ccc(cc1)-c1c(cnn1C)-c1nn(C)c2ncnc(N3CC[C@H](C3)N(C)C)c12 |r|
Show InChI InChI=1S/C24H30N8/c1-6-16-7-9-17(10-8-16)22-19(13-27-30(22)4)21-20-23(31(5)28-21)25-15-26-24(20)32-12-11-18(14-32)29(2)3/h7-10,13,15,18H,6,11-12,14H2,1-5H3/t18-/m1/s1
n/an/a 4.90n/an/an/an/an/an/a
Pfizer Inc.
Curated by ChEMBL
Assay Description
Inhibition of full length recombinant human FLAG-tagged PDE2A3 expressed in sf21 cells using [3H]cGMP as substrate by scintillation proximity assay
J Med Chem 60: 5673-5698 (2017)
Article DOI: 10.1021/acs.jmedchem.7b00397
BindingDB Entry DOI: 10.7270/Q2VX0JNT
3D
3D Structure (crystal)
Homo sapiens phosphodiesterase 2A (PDE2A)
(Homo sapiens (Human))
BDBM130956
(US8829010, 7)
Show SMILES CCc1ccc(cc1)-c1c(cnn1C)-c1nn(C)c2ncnc(N3CC[C@H](C3)N(C)C)c12 |r|
Show InChI InChI=1S/C24H30N8/c1-6-16-7-9-17(10-8-16)22-19(13-27-30(22)4)21-20-23(31(5)28-21)25-15-26-24(20)32-12-11-18(14-32)29(2)3/h7-10,13,15,18H,6,11-12,14H2,1-5H3/t18-/m1/s1
US Patent
n/an/a<5.84n/an/an/an/an/an/a
Pfizer Inc.
US Patent
Assay Description
In the present assay, the activity of the test substances on human full-length PDE2A3 enzyme was determined using the [3H]-cGMP scintillation proximi...
US Patent US8829010 (2014)
BindingDB Entry DOI: 10.7270/Q2PR7TNH
3D
3D Structure (crystal)