BDBM13104 2-{[(4-chlorophenyl)methyl](4-methoxybenzene)sulfonamido}-N-hydroxyacetamide::CGS 27023A Analog 32
SMILES: COc1ccc(cc1)S(=O)(=O)N(CC(=O)NO)Cc1ccc(Cl)cc1
InChI Key: InChIKey=HBPRCALADDGDIK-UHFFFAOYSA-N
Data: 1 KI  3 IC50
Activity Spreadsheet -- Enzyme Inhibition Constant Data from BindingDB
Found 4 hits for monomerid = 13104
Trg + Lig
Ki
nM
ΔG°
kcal/mole
IC50
nM
Kd
nM
EC50/IC50
nM
koff
s-1
kon
M-1s-1
pHTemp
°C
Stromelysin-1
(Homo sapiens (Human))
BDBM13104
(2-{[(4-chlorophenyl)methyl](4-methoxybenzene)sulfo...)
Show SMILES COc1ccc(cc1)S(=O)(=O)N(CC(=O)NO)Cc1ccc(Cl)cc1
Show InChI InChI=1S/C16H17ClN2O5S/c1-24-14-6-8-15(9-7-14)25(22,23)19(11-16(20)18-21)10-12-2-4-13(17)5-3-12/h2-9,21H,10-11H2,1H3,(H,18,20)
Reactome pathway
94n/an/an/an/an/an/an/an/a
Novartis Pharmaceuticals
Assay Description
Stromelysin inhibitory activity is based on the hydrolysis of substance P by recombinant human stromelysin to generate a fragment, substance P 7-11, ...
J Med Chem 40: 2525-32 (1997)
Article DOI: 10.1021/jm960871c
BindingDB Entry DOI: 10.7270/Q2MW2FC7
72 kDa type IV collagenase
(Homo sapiens (Human))
BDBM13104
(2-{[(4-chlorophenyl)methyl](4-methoxybenzene)sulfo...)
Show SMILES COc1ccc(cc1)S(=O)(=O)N(CC(=O)NO)Cc1ccc(Cl)cc1
Show InChI InChI=1S/C16H17ClN2O5S/c1-24-14-6-8-15(9-7-14)25(22,23)19(11-16(20)18-21)10-12-2-4-13(17)5-3-12/h2-9,21H,10-11H2,1H3,(H,18,20)
Reactome pathway
n/an/a 140n/an/an/an/an/an/a
FibroGen Inc.
Curated by ChEMBL
Assay Description
Inhibition of para-amino phenylmercuric acetate-activated MMP2 using Mca-P-L-G-L-Dap(Dnp)-A-R-NH2 as substrate after 1 hr by fluorescence assay
Bioorg Med Chem Lett 22: 7397-401 (2012)
Article DOI: 10.1016/j.bmcl.2012.10.067
BindingDB Entry DOI: 10.7270/Q22808SM
Bone morphogenetic protein 1
(Homo sapiens (Human))
BDBM13104
(2-{[(4-chlorophenyl)methyl](4-methoxybenzene)sulfo...)
Show SMILES COc1ccc(cc1)S(=O)(=O)N(CC(=O)NO)Cc1ccc(Cl)cc1
Show InChI InChI=1S/C16H17ClN2O5S/c1-24-14-6-8-15(9-7-14)25(22,23)19(11-16(20)18-21)10-12-2-4-13(17)5-3-12/h2-9,21H,10-11H2,1H3,(H,18,20)
Reactome pathway
n/an/a 1.90E+4n/an/an/an/an/an/a
FibroGen Inc.
Curated by ChEMBL
Assay Description
Inhibition of PCP after 1 hr by fluorescence assay
Bioorg Med Chem Lett 22: 7397-401 (2012)
Article DOI: 10.1016/j.bmcl.2012.10.067
BindingDB Entry DOI: 10.7270/Q22808SM
Matrix metalloproteinase-9
(Homo sapiens (Human))
BDBM13104
(2-{[(4-chlorophenyl)methyl](4-methoxybenzene)sulfo...)
Show SMILES COc1ccc(cc1)S(=O)(=O)N(CC(=O)NO)Cc1ccc(Cl)cc1
Show InChI InChI=1S/C16H17ClN2O5S/c1-24-14-6-8-15(9-7-14)25(22,23)19(11-16(20)18-21)10-12-2-4-13(17)5-3-12/h2-9,21H,10-11H2,1H3,(H,18,20)
Reactome pathway
n/an/a 50n/an/an/an/an/an/a
FibroGen Inc.
Curated by ChEMBL
Assay Description
Inhibition of para-amino phenylmercuric acetate-activated MMP9 using Mca-P-L-G-L-Dap(Dnp)-A-R-NH2 as substrate after 1 hr by fluorescence assay
Bioorg Med Chem Lett 22: 7397-401 (2012)
Article DOI: 10.1016/j.bmcl.2012.10.067
BindingDB Entry DOI: 10.7270/Q22808SM