BDBM13223 2-acetamido-4-methyl-N-(2,4,6-trimethylphenyl)-1,3-thiazole-5-carboxamide::BMS-354825 2-Amino-4-methyl-thiazole Analog 7c
SMILES: CC(=O)Nc1nc(C)c(s1)C(=O)Nc1c(C)cc(C)cc1C
InChI Key: InChIKey=PDLUGBLZZAJWKN-UHFFFAOYSA-N
Data: 2 IC50
Activity Spreadsheet -- Enzyme Inhibition Constant Data from BindingDB
Found 2 hits for monomerid = 13223
Trg + Lig
Ki
nM
ΔG°
kcal/mole
IC50
nM
Kd
nM
EC50/IC50
nM
koff
s-1
kon
M-1s-1
pHTemp
°C
Lck
(Mus musculus)
BDBM13223
(2-acetamido-4-methyl-N-(2,4,6-trimethylphenyl)-1,3...)
Show SMILES CC(=O)Nc1nc(C)c(s1)C(=O)Nc1c(C)cc(C)cc1C
Show InChI InChI=1S/C16H19N3O2S/c1-8-6-9(2)13(10(3)7-8)19-15(21)14-11(4)17-16(22-14)18-12(5)20/h6-7H,1-5H3,(H,19,21)(H,17,18,20)
Reactome pathway
n/an/a 510n/an/an/an/a7.022
Bristol-Myers Squibb Company
Assay Description
IC50 is the inhibitor concentration, which inhibits 50% of kinase activity that catalyzes the transfer of the terminal phosphate from [gamma-33P] lab...
J Med Chem 49: 6819-32 (2006)
Article DOI: 10.1021/jm060727j
BindingDB Entry DOI: 10.7270/Q2QN6501
Tyrosine-protein kinase Lck
(Homo sapiens (Human))
BDBM13223
(2-acetamido-4-methyl-N-(2,4,6-trimethylphenyl)-1,3...)
Show SMILES CC(=O)Nc1nc(C)c(s1)C(=O)Nc1c(C)cc(C)cc1C
Show InChI InChI=1S/C16H19N3O2S/c1-8-6-9(2)13(10(3)7-8)19-15(21)14-11(4)17-16(22-14)18-12(5)20/h6-7H,1-5H3,(H,19,21)(H,17,18,20)
n/an/a 480n/an/an/an/a7.022
Bristol-Myers Squibb Company
Assay Description
IC50 is the inhibitor concentration, which inhibits 50% of kinase activity that catalyzes the transfer of the terminal phosphate from [gamma-33P] lab...
J Med Chem 49: 6819-32 (2006)
Article DOI: 10.1021/jm060727j
BindingDB Entry DOI: 10.7270/Q2QN6501