BDBM13232 2-(2-furoylamino)-N-mesityl-4-methyl-1,3-thiazole-5-carboxamide::2-N-(furan-2-)-4-methyl-5-N-(2,4,6-trimethylphenyl)-1,3-thiazole-2,5-diamido::BMS-354825 2-Amino-4-methyl-thiazole Analog 7f::CHEMBL131661
SMILES: Cc1nc(NC(=O)c2ccco2)sc1C(=O)Nc1c(C)cc(C)cc1C
InChI Key: InChIKey=KMFDWSKWECMQEX-UHFFFAOYSA-N
Data: 2 IC50
Activity Spreadsheet -- Enzyme Inhibition Constant Data from BindingDB
Found 2 hits for monomerid = 13232
Trg + Lig
Ki
nM
ΔG°
kcal/mole
IC50
nM
Kd
nM
EC50/IC50
nM
koff
s-1
kon
M-1s-1
pHTemp
°C
Tyrosine-protein kinase Lck
(Homo sapiens (Human))
BDBM13232
(2-(2-furoylamino)-N-mesityl-4-methyl-1,3-thiazole-...)
Show SMILES Cc1nc(NC(=O)c2ccco2)sc1C(=O)Nc1c(C)cc(C)cc1C
Show InChI InChI=1S/C19H19N3O3S/c1-10-8-11(2)15(12(3)9-10)21-18(24)16-13(4)20-19(26-16)22-17(23)14-6-5-7-25-14/h5-9H,1-4H3,(H,21,24)(H,20,22,23)
n/an/a 360n/an/an/an/an/an/a
Bristol-Myers Squibb Pharmaceutical Research Institute
Curated by ChEMBL
Assay Description
Inhibitory activity of the compound human Lck(hLck) kinase
Bioorg Med Chem Lett 13: 4007-10 (2003)
BindingDB Entry DOI: 10.7270/Q2CC103J
Tyrosine-protein kinase Lck
(Homo sapiens (Human))
BDBM13232
(2-(2-furoylamino)-N-mesityl-4-methyl-1,3-thiazole-...)
Show SMILES Cc1nc(NC(=O)c2ccco2)sc1C(=O)Nc1c(C)cc(C)cc1C
Show InChI InChI=1S/C19H19N3O3S/c1-10-8-11(2)15(12(3)9-10)21-18(24)16-13(4)20-19(26-16)22-17(23)14-6-5-7-25-14/h5-9H,1-4H3,(H,21,24)(H,20,22,23)
n/an/a 360n/an/an/an/an/an/a
Bristol-Myers Squibb Company
Assay Description
IC50 is the inhibitor concentration, which inhibits 50% of kinase activity that catalyzes the transfer of the terminal phosphate from [gamma-33P] lab...
J Med Chem 49: 6819-32 (2006)
Article DOI: 10.1021/jm060727j
BindingDB Entry DOI: 10.7270/Q2QN6501