BDBM132321 US8841312, 67
SMILES: NCC1CCCN(C1)c1ccc(Nc2ncc3c4ccncc4n(C4CCCC4)c3n2)nc1
InChI Key: InChIKey=FWXDAOVLHSUOKI-UHFFFAOYSA-N
Data: 1 IC50
Activity Spreadsheet -- Enzyme Inhibition Constant Data from BindingDB
Found 1 hit for monomerid = 132321
Trg + Lig
Ki
nM
ΔG°
kcal/mole
IC50
nM
Kd
nM
EC50/IC50
nM
koff
s-1
kon
M-1s-1
pHTemp
°C
Cyclin-dependent kinase 4
(Homo sapiens (Human))
BDBM132321
(US8841312, 67)
Show SMILES NCC1CCCN(C1)c1ccc(Nc2ncc3c4ccncc4n(C4CCCC4)c3n2)nc1
Show InChI InChI=1S/C25H30N8/c26-12-17-4-3-11-32(16-17)19-7-8-23(28-13-19)30-25-29-14-21-20-9-10-27-15-22(20)33(24(21)31-25)18-5-1-2-6-18/h7-10,13-15,17-18H,1-6,11-12,16,26H2,(H,28,29,30,31)
NCI pathway
Reactome pathway
US Patent
n/an/a 1.30n/an/an/an/a7.437
Amgen Inc.
US Patent
Assay Description
The Cdk4 and Cdk6 inhibitory activity of the compounds is measured with a kinase inhibition assay using recombinant Cdk4/CyclinD1 or Cdk6/CyclinD3 pr...
US Patent US8841312 (2014)
BindingDB Entry DOI: 10.7270/Q2H41Q4H