BDBM13237 5-N-(2-chloro-6-methylphenyl)-2-N-(furan-2-)-4-methyl-1,3-thiazole-2,5-diamido::BMS-354825 2-Amino-4-methyl-thiazole Analog 7k::CHEMBL127500::N-(2-chloro-6-methylphenyl)-2-(2-furoylamino)-4-methyl-1,3-thiazole-5-carboxamide
SMILES: Cc1nc(NC(=O)c2ccco2)sc1C(=O)Nc1c(C)cccc1Cl
InChI Key: InChIKey=NDBMGDUQTNRAQN-UHFFFAOYSA-N
Data: 2 IC50
Activity Spreadsheet -- Enzyme Inhibition Constant Data from BindingDB
Found 2 hits for monomerid = 13237
Trg + Lig
Ki
nM
ΔG°
kcal/mole
IC50
nM
Kd
nM
EC50/IC50
nM
koff
s-1
kon
M-1s-1
pHTemp
°C
Tyrosine-protein kinase Lck
(Homo sapiens (Human))
BDBM13237
(5-N-(2-chloro-6-methylphenyl)-2-N-(furan-2-)-4-met...)
Show SMILES Cc1nc(NC(=O)c2ccco2)sc1C(=O)Nc1c(C)cccc1Cl
Show InChI InChI=1S/C17H14ClN3O3S/c1-9-5-3-6-11(18)13(9)20-16(23)14-10(2)19-17(25-14)21-15(22)12-7-4-8-24-12/h3-8H,1-2H3,(H,20,23)(H,19,21,22)
n/an/a 710n/an/an/an/an/an/a
Bristol-Myers Squibb Pharmaceutical Research Institute
Curated by ChEMBL
Assay Description
Inhibitory activity of the compound human Lck(hLck) kinase
Bioorg Med Chem Lett 13: 4007-10 (2003)
BindingDB Entry DOI: 10.7270/Q2CC103J
Tyrosine-protein kinase Lck
(Homo sapiens (Human))
BDBM13237
(5-N-(2-chloro-6-methylphenyl)-2-N-(furan-2-)-4-met...)
Show SMILES Cc1nc(NC(=O)c2ccco2)sc1C(=O)Nc1c(C)cccc1Cl
Show InChI InChI=1S/C17H14ClN3O3S/c1-9-5-3-6-11(18)13(9)20-16(23)14-10(2)19-17(25-14)21-15(22)12-7-4-8-24-12/h3-8H,1-2H3,(H,20,23)(H,19,21,22)
n/an/a 710n/an/an/an/an/an/a
Bristol-Myers Squibb Company
Assay Description
IC50 is the inhibitor concentration, which inhibits 50% of kinase activity that catalyzes the transfer of the terminal phosphate from [gamma-33P] lab...
J Med Chem 49: 6819-32 (2006)
Article DOI: 10.1021/jm060727j
BindingDB Entry DOI: 10.7270/Q2QN6501