BDBM13275 BMS-354825 2-Heteroarylamino-thiazole Analog 12t::N-(2-Chloro-6-methylphenyl)-2-(2-methyl-6-morpholinopyrimidin-4-ylamino)-1,3-thiazole-5-carboxamide::N-(2-chloro-6-methylphenyl)-2-{[2-methyl-6-(morpholin-4-yl)pyrimidin-4-yl]amino}-1,3-thiazole-5-carboxamide
SMILES: Cc1cccc(Cl)c1NC(=O)c1cnc(Nc2cc(nc(C)n2)N2CCOCC2)s1
InChI Key: InChIKey=JXKNOTHMBHBSTI-UHFFFAOYSA-N
Data: 1 IC50
PDB links: 1 PDB ID contains inhibitors having a similarity of 90% to this monomer.
Activity Spreadsheet -- Enzyme Inhibition Constant Data from BindingDB
Found 1 hit for monomerid = 13275
Trg + Lig
Ki
nM
ΔG°
kcal/mole
IC50
nM
Kd
nM
EC50/IC50
nM
koff
s-1
kon
M-1s-1
pHTemp
°C
Tyrosine-protein kinase Lck
(Homo sapiens (Human))
BDBM13275
(BMS-354825 2-Heteroarylamino-thiazole Analog 12t |...)
Show SMILES Cc1cccc(Cl)c1NC(=O)c1cnc(Nc2cc(nc(C)n2)N2CCOCC2)s1
Show InChI InChI=1S/C20H21ClN6O2S/c1-12-4-3-5-14(21)18(12)26-19(28)15-11-22-20(30-15)25-16-10-17(24-13(2)23-16)27-6-8-29-9-7-27/h3-5,10-11H,6-9H2,1-2H3,(H,26,28)(H,22,23,24,25)
n/an/a 1.30n/an/an/an/an/an/a
Bristol-Myers Squibb Company
Assay Description
IC50 is the inhibitor concentration, which inhibits 50% of kinase activity that catalyzes the transfer of the terminal phosphate from [gamma-33P] lab...
J Med Chem 49: 6819-32 (2006)
Article DOI: 10.1021/jm060727j
BindingDB Entry DOI: 10.7270/Q2QN6501