null
SMILES: CCOc1cc(F)cc(c1)-n1nc(NC(=O)[C@@H]2CNC(=O)C2)cc1-c1cccc(CO[C@H](C)C(F)(F)F)c1
InChI Key: InChIKey=BBQFSWVFQKLBNV-QAPCUYQASA-N
Activity Spreadsheet -- Enzyme Inhibition Constant Data from BindingDB
Found 1 hit for monomerid = 133209
Trg + Lig
Ki
nM
ΔG°
kcal/mole
IC50
nM
Kd
nM
EC50/IC50
nM
koff
s-1
kon
M-1s-1
pHTemp
°C
Sodium/glucose cotransporter 1
(Homo sapiens (Human))
BDBM133209
(US8846746, 534)
Show SMILES CCOc1cc(F)cc(c1)-n1nc(NC(=O)[C@@H]2CNC(=O)C2)cc1-c1cccc(CO[C@H](C)C(F)(F)F)c1 |r|
Show InChI InChI=1S/C26H26F4N4O4/c1-3-37-21-10-19(27)9-20(11-21)34-22(12-23(33-34)32-25(36)18-8-24(35)31-13-18)17-6-4-5-16(7-17)14-38-15(2)26(28,29)30/h4-7,9-12,15,18H,3,8,13-14H2,1-2H3,(H,31,35)(H,32,33,36)/t15-,18+/m1/s1
US Patent
n/an/a 1.80n/an/an/an/an/a37
Japan Tobacco Inc.
US Patent
Assay Description
The stable cell line expressing human SGLT1 was seeded at 5x104 cells/well on BioCoat Poly-D-Lysine 96 well plate with Lid (Becton Dickinson and Comp...
US Patent US8846746 (2014)
BindingDB Entry DOI: 10.7270/Q27M06MJ