BDBM13321 1-Methyl-1H-imidazole-4-sulfonic Acid (2-Bromoallyl)-[6-cyano-1-(3-methyl-3H-imidazol-4-ylmethyl)-1,2,3,4-tetrahydroquinolin-3-yl]amide::N-(2-bromoprop-2-en-1-yl)-N-{6-cyano-1-[(1-methyl-1H-imidazol-5-yl)methyl]-1,2,3,4-tetrahydroquinolin-3-yl}-1-methyl-1H-imidazole-4-sulfonamide::tetrahydroquinoline (THQ)-based inhibitor 4c
SMILES: Cn1cnc(c1)S(=O)(=O)N(CC(Br)=C)C1CN(Cc2cncn2C)c2ccc(cc2C1)C#N
InChI Key: InChIKey=SPEKKKWCEBGMGP-UHFFFAOYSA-N
Data: 2 IC50
Activity Spreadsheet -- Enzyme Inhibition Constant Data from BindingDB
Found 2 hits for monomerid = 13321
Trg + Lig
Ki
nM
ΔG°
kcal/mole
IC50
nM
Kd
nM
EC50/IC50
nM
koff
s-1
kon
M-1s-1
pHTemp
°C
Protein farnesyltransferase
(Rattus norvegicus (rat))
BDBM13321
(1-Methyl-1H-imidazole-4-sulfonic Acid (2-Bromoally...)
Show SMILES Cn1cnc(c1)S(=O)(=O)N(CC(Br)=C)C1CN(Cc2cncn2C)c2ccc(cc2C1)C#N
Show InChI InChI=1S/C22H24BrN7O2S/c1-16(23)10-30(33(31,32)22-13-27(2)15-26-22)19-7-18-6-17(8-24)4-5-21(18)29(11-19)12-20-9-25-14-28(20)3/h4-6,9,13-15,19H,1,7,10-12H2,2-3H3
n/an/a 0.800n/an/an/an/an/an/a
University of Washington at Seattle
Assay Description
Assays for PFT activity were performed with a PFT-specific scintillation assay (SPA) kit (Amersham Biosciences, Piscataway, NJ). IC50 values were cal...
J Med Chem 48: 3704-13 (2005)
Article DOI: 10.1021/jm0491039
BindingDB Entry DOI: 10.7270/Q2BC3WSQ
Protein Farnesyltransferase (PFT)
(Plasmodium falciparum (malaria parasite P. falcipa...)
BDBM13321
(1-Methyl-1H-imidazole-4-sulfonic Acid (2-Bromoally...)
Show SMILES Cn1cnc(c1)S(=O)(=O)N(CC(Br)=C)C1CN(Cc2cncn2C)c2ccc(cc2C1)C#N
Show InChI InChI=1S/C22H24BrN7O2S/c1-16(23)10-30(33(31,32)22-13-27(2)15-26-22)19-7-18-6-17(8-24)4-5-21(18)29(11-19)12-20-9-25-14-28(20)3/h4-6,9,13-15,19H,1,7,10-12H2,2-3H3
n/an/a 0.400n/an/an/an/a7.537
University of Washington at Seattle
Assay Description
Assays for PFT activity were performed with a PFT-specific scintillation assay (SPA) kit (Amersham Biosciences, Piscataway, NJ). IC50 values were cal...
J Med Chem 48: 3704-13 (2005)
Article DOI: 10.1021/jm0491039
BindingDB Entry DOI: 10.7270/Q2BC3WSQ