BDBM13325 4-{[[6-Cyano-1-(3-methyl-3H-imidazol-4-ylmethyl)-1,2,3,4-tetrahydroquinolin-3-yl]-(1-methyl-1H-imidazole-4-sulfonyl)amino]methyl}-piperidine-1-carboxylic Acid tert-Butyl Ester::tert-butyl 4-[({6-cyano-1-[(1-methyl-1H-imidazol-5-yl)methyl]-1,2,3,4-tetrahydroquinolin-3-yl}(1-methyl-1H-imidazole-4-)sulfonamido)methyl]piperidine-1-carboxylate::tetrahydroquinoline (THQ)-based inhibitor 4g
SMILES: Cn1cnc(c1)S(=O)(=O)N(CC1CCN(CC1)C(=O)OC(C)(C)C)C1CN(Cc2cncn2C)c2ccc(cc2C1)C#N
InChI Key: InChIKey=MBTVJGVVXHCRCZ-UHFFFAOYSA-N
Data: 2 IC50
Activity Spreadsheet -- Enzyme Inhibition Constant Data from BindingDB
Found 2 hits for monomerid = 13325
Trg + Lig
Ki
nM
ΔG°
kcal/mole
IC50
nM
Kd
nM
EC50/IC50
nM
koff
s-1
kon
M-1s-1
pHTemp
°C
Protein farnesyltransferase
(Rattus norvegicus (rat))
BDBM13325
(4-{[[6-Cyano-1-(3-methyl-3H-imidazol-4-ylmethyl)-1...)
Show SMILES Cn1cnc(c1)S(=O)(=O)N(CC1CCN(CC1)C(=O)OC(C)(C)C)C1CN(Cc2cncn2C)c2ccc(cc2C1)C#N
Show InChI InChI=1S/C30H40N8O4S/c1-30(2,3)42-29(39)36-10-8-22(9-11-36)16-38(43(40,41)28-19-34(4)21-33-28)25-13-24-12-23(14-31)6-7-27(24)37(17-25)18-26-15-32-20-35(26)5/h6-7,12,15,19-22,25H,8-11,13,16-18H2,1-5H3
n/an/a 3.20n/an/an/an/an/an/a
University of Washington at Seattle
Assay Description
Assays for PFT activity were performed with a PFT-specific scintillation assay (SPA) kit (Amersham Biosciences, Piscataway, NJ). IC50 values were cal...
J Med Chem 48: 3704-13 (2005)
Article DOI: 10.1021/jm0491039
BindingDB Entry DOI: 10.7270/Q2BC3WSQ
Protein Farnesyltransferase (PFT)
(Plasmodium falciparum (malaria parasite P. falcipa...)
BDBM13325
(4-{[[6-Cyano-1-(3-methyl-3H-imidazol-4-ylmethyl)-1...)
Show SMILES Cn1cnc(c1)S(=O)(=O)N(CC1CCN(CC1)C(=O)OC(C)(C)C)C1CN(Cc2cncn2C)c2ccc(cc2C1)C#N
Show InChI InChI=1S/C30H40N8O4S/c1-30(2,3)42-29(39)36-10-8-22(9-11-36)16-38(43(40,41)28-19-34(4)21-33-28)25-13-24-12-23(14-31)6-7-27(24)37(17-25)18-26-15-32-20-35(26)5/h6-7,12,15,19-22,25H,8-11,13,16-18H2,1-5H3
n/an/a 1.10n/an/an/an/a7.537
University of Washington at Seattle
Assay Description
Assays for PFT activity were performed with a PFT-specific scintillation assay (SPA) kit (Amersham Biosciences, Piscataway, NJ). IC50 values were cal...
J Med Chem 48: 3704-13 (2005)
Article DOI: 10.1021/jm0491039
BindingDB Entry DOI: 10.7270/Q2BC3WSQ