BDBM13328 N-{6-cyano-1-[(1-methyl-1H-imidazol-5-yl)methyl]-1,2,3,4-tetrahydroquinolin-3-yl}-N-[(5-methyl-3-phenyl-1,2-oxazol-4-yl)methyl]pyridine-2-sulfonamide::Pyridine-2-sulfonic Acid [6-Cyano-1-(3-methyl-3H-imidazol-4-ylmethyl)-1,2,3,4-tetrahydroquinolin-3-yl]-(5-methyl-3-phenylisoxazol-4-ylmethyl)amide::tetrahydroquinoline (THQ)-based inhibitor 4j
SMILES: Cc1onc(c1CN(C1CN(Cc2cncn2C)c2ccc(cc2C1)C#N)S(=O)(=O)c1ccccn1)-c1ccccc1
InChI Key: InChIKey=UUXJPDYOJAJQGO-UHFFFAOYSA-N
Data: 3 IC50
Activity Spreadsheet -- Enzyme Inhibition Constant Data from BindingDB
Found 3 hits for monomerid = 13328
Trg + Lig
Ki
nM
ΔG°
kcal/mole
IC50
nM
Kd
nM
EC50/IC50
nM
koff
s-1
kon
M-1s-1
pHTemp
°C
Protein Farnesyltransferase (PFT)
(Plasmodium falciparum (malaria parasite P. falcipa...)
BDBM13328
(N-{6-cyano-1-[(1-methyl-1H-imidazol-5-yl)methyl]-1...)
Show SMILES Cc1onc(c1CN(C1CN(Cc2cncn2C)c2ccc(cc2C1)C#N)S(=O)(=O)c1ccccn1)-c1ccccc1
Show InChI InChI=1S/C31H29N7O3S/c1-22-28(31(35-41-22)24-8-4-3-5-9-24)20-38(42(39,40)30-10-6-7-13-34-30)26-15-25-14-23(16-32)11-12-29(25)37(18-26)19-27-17-33-21-36(27)2/h3-14,17,21,26H,15,18-20H2,1-2H3
n/an/a 0.800n/an/an/an/a7.537
University of Washington at Seattle
Assay Description
Assays for PFT activity were performed with a PFT-specific scintillation assay (SPA) kit (Amersham Biosciences, Piscataway, NJ). IC50 values were cal...
J Med Chem 48: 3704-13 (2005)
Article DOI: 10.1021/jm0491039
BindingDB Entry DOI: 10.7270/Q2BC3WSQ
Protein Farnesyltransferase (PFT)
(Homo sapiens (Human))
BDBM13328
(N-{6-cyano-1-[(1-methyl-1H-imidazol-5-yl)methyl]-1...)
Show SMILES Cc1onc(c1CN(C1CN(Cc2cncn2C)c2ccc(cc2C1)C#N)S(=O)(=O)c1ccccn1)-c1ccccc1
Show InChI InChI=1S/C31H29N7O3S/c1-22-28(31(35-41-22)24-8-4-3-5-9-24)20-38(42(39,40)30-10-6-7-13-34-30)26-15-25-14-23(16-32)11-12-29(25)37(18-26)19-27-17-33-21-36(27)2/h3-14,17,21,26H,15,18-20H2,1-2H3
Reactome pathway
n/an/a 3n/an/an/an/an/an/a
University of Washington
Curated by ChEMBL
Assay Description
Inhibition of protein farnesyltransferase
J Med Chem 50: 4585-605 (2007)
Article DOI: 10.1021/jm0703340
BindingDB Entry DOI: 10.7270/Q2RX9FT9
Protein farnesyltransferase
(Rattus norvegicus (rat))
BDBM13328
(N-{6-cyano-1-[(1-methyl-1H-imidazol-5-yl)methyl]-1...)
Show SMILES Cc1onc(c1CN(C1CN(Cc2cncn2C)c2ccc(cc2C1)C#N)S(=O)(=O)c1ccccn1)-c1ccccc1
Show InChI InChI=1S/C31H29N7O3S/c1-22-28(31(35-41-22)24-8-4-3-5-9-24)20-38(42(39,40)30-10-6-7-13-34-30)26-15-25-14-23(16-32)11-12-29(25)37(18-26)19-27-17-33-21-36(27)2/h3-14,17,21,26H,15,18-20H2,1-2H3
n/an/a 3n/an/an/an/an/an/a
University of Washington at Seattle
Assay Description
Assays for PFT activity were performed with a PFT-specific scintillation assay (SPA) kit (Amersham Biosciences, Piscataway, NJ). IC50 values were cal...
J Med Chem 48: 3704-13 (2005)
Article DOI: 10.1021/jm0491039
BindingDB Entry DOI: 10.7270/Q2BC3WSQ