BDBM133424 US8846719, 109
SMILES: Cc1onc(c1COc1ccc(cn1)C(=O)NC1CCOCC1)-c1ccc(F)cc1
InChI Key: InChIKey=RKAXYUZQFLSKQW-UHFFFAOYSA-N
Data: 1 KI
Activity Spreadsheet -- Enzyme Inhibition Constant Data from BindingDB
Found 1 hit for monomerid = 133424
Trg + Lig
Ki
nM
ΔG°
kcal/mole
IC50
nM
Kd
nM
EC50/IC50
nM
koff
s-1
kon
M-1s-1
pHTemp
°C
Gamma-aminobutyric acid receptor subunit alpha-5 (GABA(A))
(Homo sapiens (Human))
BDBM133424
(US8846719, 109)
Show SMILES Cc1onc(c1COc1ccc(cn1)C(=O)NC1CCOCC1)-c1ccc(F)cc1
Show InChI InChI=1S/C22H22FN3O4/c1-14-19(21(26-30-14)15-2-5-17(23)6-3-15)13-29-20-7-4-16(12-24-20)22(27)25-18-8-10-28-11-9-18/h2-7,12,18H,8-11,13H2,1H3,(H,25,27)
Reactome pathway
US Patent
0.800 -11.5n/an/an/an/an/a7.54
Roche Palo Alto LLC
US Patent
Assay Description
Radioligand binding assays were carried out in a volume of 200 mL (96-well plates) which contained 100 mL of cell memebranes, [3H]flumazenil at a con...
US Patent US8846719 (2014)
BindingDB Entry DOI: 10.7270/Q2V986RV