BDBM13354 3-(3-tert-butyl-1-phenyl-1H-pyrazol-5-yl)-1-(4-chlorophenyl)urea::CHEMBL85860::Urea 16
SMILES: CC(C)(C)c1cc(NC(=O)Nc2ccc(Cl)cc2)n(n1)-c1ccccc1
InChI Key: InChIKey=XIWRCSVXKPGGAJ-UHFFFAOYSA-N
Data: 1 IC50
PDB links: 1 PDB ID matches this monomer.
Activity Spreadsheet -- Enzyme Inhibition Constant Data from BindingDB
Found 1 hit for monomerid = 13354
Trg + Lig
Ki
nM
ΔG°
kcal/mole
IC50
nM
Kd
nM
EC50/IC50
nM
koff
s-1
kon
M-1s-1
pHTemp
°C
Mitogen-activated protein kinase 14
(Homo sapiens (Human))
BDBM13354
(3-(3-tert-butyl-1-phenyl-1H-pyrazol-5-yl)-1-(4-chl...)
Show SMILES CC(C)(C)c1cc(NC(=O)Nc2ccc(Cl)cc2)n(n1)-c1ccccc1
Show InChI InChI=1S/C20H21ClN4O/c1-20(2,3)17-13-18(25(24-17)16-7-5-4-6-8-16)23-19(26)22-15-11-9-14(21)10-12-15/h4-13H,1-3H3,(H2,22,23,26)
NCI pathway
Reactome pathway
n/an/a 196n/an/an/an/a7.422
Astex
Assay Description
IC50 is the inhibitor concentration, which inhibits 50% of kinase activity that catalyzes the transfer of the terminal phosphate from [gamma-33P] lab...
J Med Chem 48: 414-26 (2005)
Article DOI: 10.1021/jm049575n
BindingDB Entry DOI: 10.7270/Q26M352S
3D
3D Structure (crystal)