BDBM133593 US8846719, 305
SMILES: Cc1onc(c1COC(O)C(C)(C)c1ccc(cn1)C(N)=O)-c1ccc(Cl)cn1
InChI Key: InChIKey=VLJFCGQHIAWPFS-UHFFFAOYSA-N
Data: 1 KI
Activity Spreadsheet -- Enzyme Inhibition Constant Data from BindingDB
Found 1 hit for monomerid = 133593
Trg + Lig
Ki
nM
ΔG°
kcal/mole
IC50
nM
Kd
nM
EC50/IC50
nM
koff
s-1
kon
M-1s-1
pHTemp
°C
Gamma-aminobutyric acid receptor subunit alpha-5 (GABA(A))
(Homo sapiens (Human))
BDBM133593
(US8846719, 305)
Show SMILES Cc1onc(c1COC(O)C(C)(C)c1ccc(cn1)C(N)=O)-c1ccc(Cl)cn1
Show InChI InChI=1S/C20H21ClN4O4/c1-11-14(17(25-29-11)15-6-5-13(21)9-23-15)10-28-19(27)20(2,3)16-7-4-12(8-24-16)18(22)26/h4-9,19,27H,10H2,1-3H3,(H2,22,26)
Reactome pathway
US Patent
0.600 -11.7n/an/an/an/an/a7.54
Roche Palo Alto LLC
US Patent
Assay Description
Radioligand binding assays were carried out in a volume of 200 mL (96-well plates) which contained 100 mL of cell memebranes, [3H]flumazenil at a con...
US Patent US8846719 (2014)
BindingDB Entry DOI: 10.7270/Q2V986RV