BDBM133685 US8846699, 1
SMILES: CC(=O)N1CCC(COc2cc3ncnc(Nc4ccc(Br)cc4F)c3cc2NC(=O)C=C)CC1
InChI Key: InChIKey=UIKREWNIYFBAFO-UHFFFAOYSA-N
Data: 2 IC50
Activity Spreadsheet -- Enzyme Inhibition Constant Data from BindingDB
Found 2 hits for monomerid = 133685
Trg + Lig
Ki
nM
ΔG°
kcal/mole
IC50
nM
Kd
nM
EC50/IC50
nM
koff
s-1
kon
M-1s-1
pHTemp
°C
Vascular endothelial growth factor receptor 2
(Homo sapiens (Human))
BDBM133685
(US8846699, 1)
Show SMILES CC(=O)N1CCC(COc2cc3ncnc(Nc4ccc(Br)cc4F)c3cc2NC(=O)C=C)CC1
Show InChI InChI=1S/C25H25BrFN5O3/c1-3-24(34)30-22-11-18-21(12-23(22)35-13-16-6-8-32(9-7-16)15(2)33)28-14-29-25(18)31-20-5-4-17(26)10-19(20)27/h3-5,10-12,14,16H,1,6-9,13H2,2H3,(H,30,34)(H,28,29,31)
NCI pathway
Reactome pathway
US Patent
n/an/a 131n/an/an/an/a7.425
Hanmi Pharm. Co., Ltd.
US Patent
Assay Description
VEGFR2 (KDR, Proquinase) enzyme assay (auto-phosphorylation assay) was carried out by using Tyrosine Kinase Assay Kit Green (Panvera). The entire ass...
US Patent US8846699 (2014)
BindingDB Entry DOI: 10.7270/Q2KW5DRK
Epidermal growth factor receptor
(Homo sapiens (Human))
BDBM133685
(US8846699, 1)
Show SMILES CC(=O)N1CCC(COc2cc3ncnc(Nc4ccc(Br)cc4F)c3cc2NC(=O)C=C)CC1
Show InChI InChI=1S/C25H25BrFN5O3/c1-3-24(34)30-22-11-18-21(12-23(22)35-13-16-6-8-32(9-7-16)15(2)33)28-14-29-25(18)31-20-5-4-17(26)10-19(20)27/h3-5,10-12,14,16H,1,6-9,13H2,2H3,(H,30,34)(H,28,29,31)
US Patent
n/an/a 3n/an/an/an/a7.425
Hanmi Pharm. Co., Ltd.
US Patent
Assay Description
EGFR1 (HER-1) enzyme assay was carried out by using Tyrosine Kinase Assay Kit Green. The entire assay was conducted in accordance with EGFR PTK inhib...
US Patent US8846699 (2014)
BindingDB Entry DOI: 10.7270/Q2KW5DRK