BDBM13375 4-({[4-chloro-2-(3-chlorophenyl)phenyl]methoxy}(1-methyl-1H-imidazol-5-yl)methyl)benzonitrile::A313326 Analogue 8
SMILES: Cn1cncc1C(OCc1ccc(Cl)cc1-c1cccc(Cl)c1)c1ccc(cc1)C#N
InChI Key: InChIKey=BHZQJRLCCBRETP-UHFFFAOYSA-N
Data: 3 IC50
Activity Spreadsheet -- Enzyme Inhibition Constant Data from BindingDB
Found 3 hits for monomerid = 13375
Trg + Lig
Ki
nM
ΔG°
kcal/mole
IC50
nM
Kd
nM
EC50/IC50
nM
koff
s-1
kon
M-1s-1
pHTemp
°C
Protein farnesyl/geranylgeranyl transferase
(Homo sapiens (Human))
BDBM13375
(4-({[4-chloro-2-(3-chlorophenyl)phenyl]methoxy}(1-...)
Show SMILES Cn1cncc1C(OCc1ccc(Cl)cc1-c1cccc(Cl)c1)c1ccc(cc1)C#N
Show InChI InChI=1S/C25H19Cl2N3O/c1-30-16-29-14-24(30)25(18-7-5-17(13-28)6-8-18)31-15-20-9-10-22(27)12-23(20)19-3-2-4-21(26)11-19/h2-12,14,16,25H,15H2,1H3
Reactome pathway
n/an/a 0.800n/an/an/an/a7.037
Globe Pharmaceutical R and Abbott Laboratories
Assay Description
The in vitro activity of compounds inhibiting FTase or GGTase-I was determined by using scintillation proximity assay (SPA) technology. The assays we...
J Med Chem 47: 612-26 (2004)
Article DOI: 10.1021/jm030434f
BindingDB Entry DOI: 10.7270/Q2Z60M8D
Protein Farnesyltransferase (PFT)
(Homo sapiens (Human))
BDBM13375
(4-({[4-chloro-2-(3-chlorophenyl)phenyl]methoxy}(1-...)
Show SMILES Cn1cncc1C(OCc1ccc(Cl)cc1-c1cccc(Cl)c1)c1ccc(cc1)C#N
Show InChI InChI=1S/C25H19Cl2N3O/c1-30-16-29-14-24(30)25(18-7-5-17(13-28)6-8-18)31-15-20-9-10-22(27)12-23(20)19-3-2-4-21(26)11-19/h2-12,14,16,25H,15H2,1H3
Reactome pathway
n/an/a 813n/an/an/an/an/an/a
The M.S. University of Baroda
Curated by ChEMBL
Assay Description
Inhibition of FTase
Bioorg Med Chem Lett 16: 1821-7 (2006)
Article DOI: 10.1016/j.bmcl.2006.01.019
BindingDB Entry DOI: 10.7270/Q2W66PJG
Geranylgeranyl transferase type I
(Bos taurus (bovine))
BDBM13375
(4-({[4-chloro-2-(3-chlorophenyl)phenyl]methoxy}(1-...)
Show SMILES Cn1cncc1C(OCc1ccc(Cl)cc1-c1cccc(Cl)c1)c1ccc(cc1)C#N
Show InChI InChI=1S/C25H19Cl2N3O/c1-30-16-29-14-24(30)25(18-7-5-17(13-28)6-8-18)31-15-20-9-10-22(27)12-23(20)19-3-2-4-21(26)11-19/h2-12,14,16,25H,15H2,1H3
n/an/a 1.40E+3n/an/an/an/an/an/a
Globe Pharmaceutical R and Abbott Laboratories
Assay Description
The in vitro activity of compounds inhibiting FTase or GGTase-I was determined by using scintillation proximity assay (SPA) technology. The assays we...
J Med Chem 47: 612-26 (2004)
Article DOI: 10.1021/jm030434f
BindingDB Entry DOI: 10.7270/Q2Z60M8D