BDBM13377 4-({[4-chloro-2-(3-methoxyphenyl)phenyl]methoxy}(1-methyl-1H-imidazol-5-yl)methyl)benzonitrile::A313326 Analogue 10
SMILES: COc1cccc(c1)-c1cc(Cl)ccc1COC(c1cncn1C)c1ccc(cc1)C#N
InChI Key: InChIKey=XLJZOXQSQVYZNS-UHFFFAOYSA-N
Data: 3 IC50
Activity Spreadsheet -- Enzyme Inhibition Constant Data from BindingDB
Found 3 hits for monomerid = 13377
Trg + Lig
Ki
nM
ΔG°
kcal/mole
IC50
nM
Kd
nM
EC50/IC50
nM
koff
s-1
kon
M-1s-1
pHTemp
°C
Protein farnesyl/geranylgeranyl transferase
(Homo sapiens (Human))
BDBM13377
(4-({[4-chloro-2-(3-methoxyphenyl)phenyl]methoxy}(1...)
Show SMILES COc1cccc(c1)-c1cc(Cl)ccc1COC(c1cncn1C)c1ccc(cc1)C#N
Show InChI InChI=1S/C26H22ClN3O2/c1-30-17-29-15-25(30)26(19-8-6-18(14-28)7-9-19)32-16-21-10-11-22(27)13-24(21)20-4-3-5-23(12-20)31-2/h3-13,15,17,26H,16H2,1-2H3
Reactome pathway
n/an/a 0.910n/an/an/an/a7.037
Globe Pharmaceutical R and Abbott Laboratories
Assay Description
The in vitro activity of compounds inhibiting FTase or GGTase-I was determined by using scintillation proximity assay (SPA) technology. The assays we...
J Med Chem 47: 612-26 (2004)
Article DOI: 10.1021/jm030434f
BindingDB Entry DOI: 10.7270/Q2Z60M8D
Protein Farnesyltransferase (PFT)
(Homo sapiens (Human))
BDBM13377
(4-({[4-chloro-2-(3-methoxyphenyl)phenyl]methoxy}(1...)
Show SMILES COc1cccc(c1)-c1cc(Cl)ccc1COC(c1cncn1C)c1ccc(cc1)C#N
Show InChI InChI=1S/C26H22ClN3O2/c1-30-17-29-15-25(30)26(19-8-6-18(14-28)7-9-19)32-16-21-10-11-22(27)13-24(21)20-4-3-5-23(12-20)31-2/h3-13,15,17,26H,16H2,1-2H3
Reactome pathway
n/an/a 912n/an/an/an/an/an/a
The M.S. University of Baroda
Curated by ChEMBL
Assay Description
Inhibition of FTase
Bioorg Med Chem Lett 16: 1821-7 (2006)
Article DOI: 10.1016/j.bmcl.2006.01.019
BindingDB Entry DOI: 10.7270/Q2W66PJG
Geranylgeranyl transferase type I
(Bos taurus (bovine))
BDBM13377
(4-({[4-chloro-2-(3-methoxyphenyl)phenyl]methoxy}(1...)
Show SMILES COc1cccc(c1)-c1cc(Cl)ccc1COC(c1cncn1C)c1ccc(cc1)C#N
Show InChI InChI=1S/C26H22ClN3O2/c1-30-17-29-15-25(30)26(19-8-6-18(14-28)7-9-19)32-16-21-10-11-22(27)13-24(21)20-4-3-5-23(12-20)31-2/h3-13,15,17,26H,16H2,1-2H3
n/an/a 2.00E+3n/an/an/an/an/an/a
Globe Pharmaceutical R and Abbott Laboratories
Assay Description
The in vitro activity of compounds inhibiting FTase or GGTase-I was determined by using scintillation proximity assay (SPA) technology. The assays we...
J Med Chem 47: 612-26 (2004)
Article DOI: 10.1021/jm030434f
BindingDB Entry DOI: 10.7270/Q2Z60M8D