BDBM13391 4-{[(4-cyanophenyl)(1-methyl-1H-imidazol-5-yl)methoxy]methyl}-3-(4-methoxyphenyl)benzonitrile::A313326 Analogue 26
SMILES: COc1ccc(cc1)-c1cc(ccc1COC(c1cncn1C)c1ccc(cc1)C#N)C#N
InChI Key: InChIKey=DRIXLVGOZDWKFA-UHFFFAOYSA-N
Data: 3 IC50
Activity Spreadsheet -- Enzyme Inhibition Constant Data from BindingDB
Found 3 hits for monomerid = 13391
Trg + Lig
Ki
nM
ΔG°
kcal/mole
IC50
nM
Kd
nM
EC50/IC50
nM
koff
s-1
kon
M-1s-1
pHTemp
°C
Protein farnesyl/geranylgeranyl transferase
(Homo sapiens (Human))
BDBM13391
(4-{[(4-cyanophenyl)(1-methyl-1H-imidazol-5-yl)meth...)
Show SMILES COc1ccc(cc1)-c1cc(ccc1COC(c1cncn1C)c1ccc(cc1)C#N)C#N
Show InChI InChI=1S/C27H22N4O2/c1-31-18-30-16-26(31)27(22-6-3-19(14-28)4-7-22)33-17-23-8-5-20(15-29)13-25(23)21-9-11-24(32-2)12-10-21/h3-13,16,18,27H,17H2,1-2H3
Reactome pathway
n/an/a 0.960n/an/an/an/an/an/a
Globe Pharmaceutical R and Abbott Laboratories
Assay Description
The in vitro activity of compounds inhibiting FTase or GGTase-I was determined by using scintillation proximity assay (SPA) technology. The assays we...
J Med Chem 47: 612-26 (2004)
Article DOI: 10.1021/jm030434f
BindingDB Entry DOI: 10.7270/Q2Z60M8D
Protein Farnesyltransferase (PFT)
(Homo sapiens (Human))
BDBM13391
(4-{[(4-cyanophenyl)(1-methyl-1H-imidazol-5-yl)meth...)
Show SMILES COc1ccc(cc1)-c1cc(ccc1COC(c1cncn1C)c1ccc(cc1)C#N)C#N
Show InChI InChI=1S/C27H22N4O2/c1-31-18-30-16-26(31)27(22-6-3-19(14-28)4-7-22)33-17-23-8-5-20(15-29)13-25(23)21-9-11-24(32-2)12-10-21/h3-13,16,18,27H,17H2,1-2H3
Reactome pathway
n/an/a 977n/an/an/an/an/an/a
The M.S. University of Baroda
Curated by ChEMBL
Assay Description
Inhibition of FTase
Bioorg Med Chem Lett 16: 1821-7 (2006)
Article DOI: 10.1016/j.bmcl.2006.01.019
BindingDB Entry DOI: 10.7270/Q2W66PJG
Geranylgeranyl transferase type I
(Bos taurus (bovine))
BDBM13391
(4-{[(4-cyanophenyl)(1-methyl-1H-imidazol-5-yl)meth...)
Show SMILES COc1ccc(cc1)-c1cc(ccc1COC(c1cncn1C)c1ccc(cc1)C#N)C#N
Show InChI InChI=1S/C27H22N4O2/c1-31-18-30-16-26(31)27(22-6-3-19(14-28)4-7-22)33-17-23-8-5-20(15-29)13-25(23)21-9-11-24(32-2)12-10-21/h3-13,16,18,27H,17H2,1-2H3
n/an/a 2.90E+3n/an/an/an/an/an/a
Globe Pharmaceutical R and Abbott Laboratories
Assay Description
The in vitro activity of compounds inhibiting FTase or GGTase-I was determined by using scintillation proximity assay (SPA) technology. The assays we...
J Med Chem 47: 612-26 (2004)
Article DOI: 10.1021/jm030434f
BindingDB Entry DOI: 10.7270/Q2Z60M8D