BDBM133915 US8846929, 91
SMILES: OCC(O)CNc1nc2ccccc2n([C@@H]2C[C@@H]3CC[C@H](C2)N3C2CCCCCCC2)c1=O
InChI Key: InChIKey=BKBGBNKHUNQUQH-PZDACTEOSA-N
Data: 4 KI
Activity Spreadsheet -- Enzyme Inhibition Constant Data from BindingDB
Found 4 hits for monomerid = 133915
Trg + Lig
Ki
nM
ΔG°
kcal/mole
IC50
nM
Kd
nM
EC50/IC50
nM
koff
s-1
kon
M-1s-1
pHTemp
°C
Opioid growth factor receptor-like protein 1
(Homo sapiens (Human))
BDBM133915
(US8846929, 91)
Show SMILES OCC(O)CNc1nc2ccccc2n([C@@H]2C[C@@H]3CC[C@H](C2)N3C2CCCCCCC2)c1=O |r|
Show InChI InChI=1S/C26H38N4O3/c31-17-22(32)16-27-25-26(33)30(24-11-7-6-10-23(24)28-25)21-14-19-12-13-20(15-21)29(19)18-8-4-2-1-3-5-9-18/h6-7,10-11,18-22,31-32H,1-5,8-9,12-17H2,(H,27,28)/t19-,20+,21+,22?
US Patent
5.54n/an/an/an/an/an/a7.4n/a
Purdue Pharma L.P.; Shionogi & Co., Ltd.
US Patent
Assay Description
Radioligand binding assays (screening and dose-displacement) used 0.1nM [3H]-nociceptin (NEN; 87.7 Cl/nimole) with 10-20 ug membrane protein in a fin...
US Patent US8846929 (2014)
BindingDB Entry DOI: 10.7270/Q2G44P04
Kappa-type opioid receptor
(Homo sapiens (Human))
BDBM133915
(US8846929, 91)
Show SMILES OCC(O)CNc1nc2ccccc2n([C@@H]2C[C@@H]3CC[C@H](C2)N3C2CCCCCCC2)c1=O |r|
Show InChI InChI=1S/C26H38N4O3/c31-17-22(32)16-27-25-26(33)30(24-11-7-6-10-23(24)28-25)21-14-19-12-13-20(15-21)29(19)18-8-4-2-1-3-5-9-18/h6-7,10-11,18-22,31-32H,1-5,8-9,12-17H2,(H,27,28)/t19-,20+,21+,22?
Reactome pathway
US Patent
224n/an/an/an/an/an/a7.4n/a
Purdue Pharma L.P.; Shionogi & Co., Ltd.
US Patent
Assay Description
Radioligand dose displacement assays used 0.4-0.8nM [3H]-U69,593 (NEN; 40 Ci/mmole) with 10-20 ug membrane protein (recombinant kappa opioid receptor...
US Patent US8846929 (2014)
BindingDB Entry DOI: 10.7270/Q2G44P04
Mu-type opioid receptor
(Homo sapiens (Human))
BDBM133915
(US8846929, 91)
Show SMILES OCC(O)CNc1nc2ccccc2n([C@@H]2C[C@@H]3CC[C@H](C2)N3C2CCCCCCC2)c1=O |r|
Show InChI InChI=1S/C26H38N4O3/c31-17-22(32)16-27-25-26(33)30(24-11-7-6-10-23(24)28-25)21-14-19-12-13-20(15-21)29(19)18-8-4-2-1-3-5-9-18/h6-7,10-11,18-22,31-32H,1-5,8-9,12-17H2,(H,27,28)/t19-,20+,21+,22?
NCI pathway
Reactome pathway
US Patent
394n/an/an/an/an/an/a7.4n/a
Purdue Pharma L.P.; Shionogi & Co., Ltd.
US Patent
Assay Description
Radioligand dose-displacement binding assays for u-opioid receptors used 0.2nM[3H]-diprenorphine (NEN, Boston, Mass.), with 5-20mg membrane protein/w...
US Patent US8846929 (2014)
BindingDB Entry DOI: 10.7270/Q2G44P04
Delta-type opioid receptor
(Homo sapiens (Human))
BDBM133915
(US8846929, 91)
Show SMILES OCC(O)CNc1nc2ccccc2n([C@@H]2C[C@@H]3CC[C@H](C2)N3C2CCCCCCC2)c1=O |r|
Show InChI InChI=1S/C26H38N4O3/c31-17-22(32)16-27-25-26(33)30(24-11-7-6-10-23(24)28-25)21-14-19-12-13-20(15-21)29(19)18-8-4-2-1-3-5-9-18/h6-7,10-11,18-22,31-32H,1-5,8-9,12-17H2,(H,27,28)/t19-,20+,21+,22?
Reactome pathway
US Patent
2.19E+4n/an/an/an/an/an/a7.4n/a
Purdue Pharma L.P.; Shionogi & Co., Ltd.
US Patent
Assay Description
Radioligand dose-displacement assays used 0.2nM [3H]-Naltrindole (NEN; 33.0 Ci/mmole) with 10-20ug membrane protein (recombinant delta opioid recepto...
US Patent US8846929 (2014)
BindingDB Entry DOI: 10.7270/Q2G44P04