BDBM13393 4-{[(4-cyanophenyl)(1-methyl-1H-imidazol-5-yl)methoxy]methyl}-3-[4-(trifluoromethoxy)phenyl]benzonitrile::A313326 Analogue 28
SMILES: Cn1cncc1C(OCc1ccc(cc1-c1ccc(OC(F)(F)F)cc1)C#N)c1ccc(cc1)C#N
InChI Key: InChIKey=KCUVPCKCJFTDON-UHFFFAOYSA-N
Data: 2 IC50
Activity Spreadsheet -- Enzyme Inhibition Constant Data from BindingDB
Found 2 hits for monomerid = 13393
Trg + Lig
Ki
nM
ΔG°
kcal/mole
IC50
nM
Kd
nM
EC50/IC50
nM
koff
s-1
kon
M-1s-1
pHTemp
°C
Geranylgeranyl transferase type I
(Bos taurus (bovine))
BDBM13393
(4-{[(4-cyanophenyl)(1-methyl-1H-imidazol-5-yl)meth...)
Show SMILES Cn1cncc1C(OCc1ccc(cc1-c1ccc(OC(F)(F)F)cc1)C#N)c1ccc(cc1)C#N
Show InChI InChI=1S/C27H19F3N4O2/c1-34-17-33-15-25(34)26(21-5-2-18(13-31)3-6-21)35-16-22-7-4-19(14-32)12-24(22)20-8-10-23(11-9-20)36-27(28,29)30/h2-12,15,17,26H,16H2,1H3
n/an/a 1.10E+3n/an/an/an/an/an/a
Globe Pharmaceutical R and Abbott Laboratories
Assay Description
The in vitro activity of compounds inhibiting FTase or GGTase-I was determined by using scintillation proximity assay (SPA) technology. The assays we...
J Med Chem 47: 612-26 (2004)
Article DOI: 10.1021/jm030434f
BindingDB Entry DOI: 10.7270/Q2Z60M8D
Protein farnesyl/geranylgeranyl transferase
(Homo sapiens (Human))
BDBM13393
(4-{[(4-cyanophenyl)(1-methyl-1H-imidazol-5-yl)meth...)
Show SMILES Cn1cncc1C(OCc1ccc(cc1-c1ccc(OC(F)(F)F)cc1)C#N)c1ccc(cc1)C#N
Show InChI InChI=1S/C27H19F3N4O2/c1-34-17-33-15-25(34)26(21-5-2-18(13-31)3-6-21)35-16-22-7-4-19(14-32)12-24(22)20-8-10-23(11-9-20)36-27(28,29)30/h2-12,15,17,26H,16H2,1H3
Reactome pathway
n/an/a 0.840n/an/an/an/an/an/a
Globe Pharmaceutical R and Abbott Laboratories
Assay Description
The in vitro activity of compounds inhibiting FTase or GGTase-I was determined by using scintillation proximity assay (SPA) technology. The assays we...
J Med Chem 47: 612-26 (2004)
Article DOI: 10.1021/jm030434f
BindingDB Entry DOI: 10.7270/Q2Z60M8D