BDBM13395 4-{[(4-cyanophenyl)(1-methyl-1H-imidazol-5-yl)methoxy]methyl}-3-(3,5-difluorophenyl)benzonitrile::A313326 Analogue 30
SMILES: Cn1cncc1C(OCc1ccc(cc1-c1cc(F)cc(F)c1)C#N)c1ccc(cc1)C#N
InChI Key: InChIKey=DNZCLSGCKHYXMM-UHFFFAOYSA-N
Data: 3 IC50
Activity Spreadsheet -- Enzyme Inhibition Constant Data from BindingDB
Found 3 hits for monomerid = 13395
Trg + Lig
Ki
nM
ΔG°
kcal/mole
IC50
nM
Kd
nM
EC50/IC50
nM
koff
s-1
kon
M-1s-1
pHTemp
°C
Protein farnesyl/geranylgeranyl transferase
(Homo sapiens (Human))
BDBM13395
(4-{[(4-cyanophenyl)(1-methyl-1H-imidazol-5-yl)meth...)
Show SMILES Cn1cncc1C(OCc1ccc(cc1-c1cc(F)cc(F)c1)C#N)c1ccc(cc1)C#N
Show InChI InChI=1S/C26H18F2N4O/c1-32-16-31-14-25(32)26(19-5-2-17(12-29)3-6-19)33-15-20-7-4-18(13-30)8-24(20)21-9-22(27)11-23(28)10-21/h2-11,14,16,26H,15H2,1H3
Reactome pathway
n/an/a 0.980n/an/an/an/an/an/a
Globe Pharmaceutical R and Abbott Laboratories
Assay Description
The in vitro activity of compounds inhibiting FTase or GGTase-I was determined by using scintillation proximity assay (SPA) technology. The assays we...
J Med Chem 47: 612-26 (2004)
Article DOI: 10.1021/jm030434f
BindingDB Entry DOI: 10.7270/Q2Z60M8D
Protein Farnesyltransferase (PFT)
(Homo sapiens (Human))
BDBM13395
(4-{[(4-cyanophenyl)(1-methyl-1H-imidazol-5-yl)meth...)
Show SMILES Cn1cncc1C(OCc1ccc(cc1-c1cc(F)cc(F)c1)C#N)c1ccc(cc1)C#N
Show InChI InChI=1S/C26H18F2N4O/c1-32-16-31-14-25(32)26(19-5-2-17(12-29)3-6-19)33-15-20-7-4-18(13-30)8-24(20)21-9-22(27)11-23(28)10-21/h2-11,14,16,26H,15H2,1H3
Reactome pathway
n/an/a 1.00E+3n/an/an/an/an/an/a
The M.S. University of Baroda
Curated by ChEMBL
Assay Description
Inhibition of FTase
Bioorg Med Chem Lett 16: 1821-7 (2006)
Article DOI: 10.1016/j.bmcl.2006.01.019
BindingDB Entry DOI: 10.7270/Q2W66PJG
Geranylgeranyl transferase type I
(Bos taurus (bovine))
BDBM13395
(4-{[(4-cyanophenyl)(1-methyl-1H-imidazol-5-yl)meth...)
Show SMILES Cn1cncc1C(OCc1ccc(cc1-c1cc(F)cc(F)c1)C#N)c1ccc(cc1)C#N
Show InChI InChI=1S/C26H18F2N4O/c1-32-16-31-14-25(32)26(19-5-2-17(12-29)3-6-19)33-15-20-7-4-18(13-30)8-24(20)21-9-22(27)11-23(28)10-21/h2-11,14,16,26H,15H2,1H3
n/an/a 1.50E+3n/an/an/an/an/an/a
Globe Pharmaceutical R and Abbott Laboratories
Assay Description
The in vitro activity of compounds inhibiting FTase or GGTase-I was determined by using scintillation proximity assay (SPA) technology. The assays we...
J Med Chem 47: 612-26 (2004)
Article DOI: 10.1021/jm030434f
BindingDB Entry DOI: 10.7270/Q2Z60M8D