null
SMILES: COc1cc(ccc1Nc1ncc(c(Oc2cccc3CN(C)C(=O)c23)n1)C(F)(F)F)C(=O)N[C@@H]1CCN(C)C[C@@H]1F
InChI Key: InChIKey=JQMJRYSPUROXJB-RBUKOAKNSA-N
Activity Spreadsheet -- Enzyme Inhibition Constant Data from BindingDB
Found 1 hit for monomerid = 134062
Trg + Lig
Ki
nM
ΔG°
kcal/mole
IC50
nM
Kd
nM
EC50/IC50
nM
koff
s-1
kon
M-1s-1
pHTemp
°C
Focal adhesion kinase 1
(Homo sapiens (Human))
BDBM134062
(US8846689, 64)
Show SMILES COc1cc(ccc1Nc1ncc(c(Oc2cccc3CN(C)C(=O)c23)n1)C(F)(F)F)C(=O)N[C@@H]1CCN(C)C[C@@H]1F |r|
Show InChI InChI=1S/C28H28F4N6O4/c1-37-10-9-19(18(29)14-37)34-24(39)15-7-8-20(22(11-15)41-3)35-27-33-12-17(28(30,31)32)25(36-27)42-21-6-4-5-16-13-38(2)26(40)23(16)21/h4-8,11-12,18-19H,9-10,13-14H2,1-3H3,(H,34,39)(H,33,35,36)/t18-,19+/m0/s1
NCI pathway
Reactome pathway
US Patent
n/an/a 1n/an/an/an/a7.5n/a
Boehringer Ingelheim International GmbH
US Patent
Assay Description
This test uses active PTK2 enzyme (Invitrogen Code PV3832) and poly-Glu-Tyr (4:1, Sigma P-0275) as the kinase substrate. The kinase activity is detec...
US Patent US8846689 (2014)
BindingDB Entry DOI: 10.7270/Q2BC3X7Z